2,2,2-Trifluoroethyl methyl ether
- Formula: C3H5F3O
- Molecular weight: 114.0664
- IUPAC Standard InChIKey: OHLVGBXMHDWRRX-UHFFFAOYSA-N
- CAS Registry Number: 460-43-5
- Chemical structure:

Phase change data

Data compiled by: Thermodynamics Research Center, NIST Boulder Laboratories, Chris Muzny director
Quantity | Value | Units | Method | Reference | Comment |
---|---|---|---|---|---|
Tboil | 304.77 | K | N/A | Sako, Sato, et al., 1996 | Uncertainty assigned by TRC = 0.1 K |
Quantity | Value | Units | Method | Reference | Comment |
Tc | 448.98 | K | N/A | Sako, Sato, et al., 1996 | Uncertainty assigned by TRC = 0.08 K |
Quantity | Value | Units | Method | Reference | Comment |
Pc | 34.67 | atm | N/A | Sako, Sato, et al., 1996 | Uncertainty assigned by TRC = 0.06 atm |
Quantity | Value | Units | Method | Reference | Comment |
ρc | 3.61 | mol/l | N/A | Sako, Sato, et al., 1996 | Uncertainty assigned by TRC = 0.04 mol/l |

Gas phase ion energetics data

Data evaluated as indicated in comments:
HL - Edward P. Hunter and Sharon G. Lias
Data compiled as indicated in comments:
LBLHLM - Sharon G. Lias, John E. Bartmess, Joel F. Liebman, John L. Holmes, Rhoda D. Levin, and W. Gary Mallard
Quantity | Value | Units | Method | Reference | Comment |
---|---|---|---|---|---|
Proton affinity (review) | 178.7 | kcal/mol | N/A | Hunter and Lias, 1998 | HL |
Quantity | Value | Units | Method | Reference | Comment |
Gas basicity | 171.7 | kcal/mol | N/A | Hunter and Lias, 1998 | HL |
Ionization energy determinations
IE (eV) | Method | Reference | Comment |
---|---|---|---|
10.53 | PE | Molder, Pikver, et al., 1983 | LBLHLM |

References

Sako, Sato, et al., 1996
Sako, T.; Sato, M.; Nakazawa, N.; Oowa, M.; Yasumoto, M.; Ito, H.; Yamashita, S.,
Critical Properties of Fluorinated Ethers,
J. Chem. Eng. Data, 1996, 41, 802-805. [all data]
Hunter and Lias, 1998
Hunter, E.P.; Lias, S.G.,
Evaluated Gas Phase Basicities and Proton Affinities of Molecules: An Update,
J. Phys. Chem. Ref. Data, 1998, 27, 3, 413-656, https://doi.org/10.1063/1.556018
. [all data]
Molder, Pikver, et al., 1983
Molder, U.H.; Pikver, R.J.; Koppel, I.A.,
Photoelectron spectra of molecules. 2. Ethers,
Org. React. (N.Y. Engl. Transl.), 1983, 20, 208. [all data]