n-Propyl fluoride
- Formula: C3H7F
- Molecular weight: 62.0861
- IUPAC Standard InChIKey: JRHNUZCXXOTJCA-UHFFFAOYSA-N
- CAS Registry Number: 460-13-9
- Chemical structure:
View 3d structure (requires JavaScript / HTML 5) - Other names: Propane, 1-fluoro-; Propyl fluoride; 1-Fluoropropane; n-C3H7F

Phase change data

Data compiled as indicated in comments:
TRC - Thermodynamics Research Center, NIST Boulder Laboratories, Chris Muzny director
AC - William E. Acree, Jr., James S. Chickos
Quantity | Value | Units | Method | Reference | Comment |
---|---|---|---|---|---|
Tboil | 269.95 | K | N/A | Grosse, 1937 | Uncertainty assigned by TRC = 1. K; TRC |
Enthalpy of vaporization
ΔvapH (kJ/mol) | Temperature (K) | Method | Reference | Comment |
---|---|---|---|---|
24.0 | 274. | A,E | Stephenson and Malanowski, 1987 | Based on data from 196. to 289. K. See also Li and Rossini, 1961 and Dykyj, 1970.; AC |

Reaction thermochemistry data

Data compiled by: Hussein Y. Afeefy, Joel F. Liebman, and Stephen E. Stein
Individual Reactions
By formula: H2 + C3H7F = C3H8 + HF
Quantity | Value | Units | Method | Reference | Comment |
---|---|---|---|---|---|
ΔrH° | -92.0 ± 2.1 | kJ/mol | Chyd | Lacher, Kianpour, et al., 1956 | gas phase; Reanalyzed by Cox and Pilcher, 1970, Original value = -95.7 ± 6.7 kJ/mol; %hf298_gas[kcal/mol]=-66.71±0.62; Kolesov and Kozina, 1986 |

Henry's Law data

Data compiled by: Rolf Sander
Henry's Law constant (water solution)
kH(T) = k°H exp(d(ln(kH))/d(1/T) ((1/T) - 1/(298.15 K)))
k°H = Henry's law constant for solubility in water at 298.15 K (mol/(kg*bar))
d(ln(kH))/d(1/T) = Temperature dependence constant (K)
k°H (mol/(kg*bar)) | d(ln(kH))/d(1/T) (K) | Method | Reference | Comment |
---|---|---|---|---|
0.061 | Q | N/A | missing citation give several references for the Henry's law constants but don't assign them to specific species. Value at T = 287. K. |

Gas phase ion energetics data

Data compiled by: Sharon G. Lias, Rhoda D. Levin, and Sherif A. Kafafi
Ionization energy determinations
IE (eV) | Method | Reference | Comment |
---|---|---|---|
11.3 | PE | Yamazaki, Katsumata, et al., 1973 | |
11.96 | PE | Yamazaki, Katsumata, et al., 1973 | Vertical value |

Normal alkane RI, non-polar column, temperature ramp

Column type | Active phase | I | Reference | Comment |
---|---|---|---|---|
Capillary | OV-101 | 389. | Zenkevich, 2005 | 25. m/0.20 mm/0.10 μm, N2/He, 6. K/min; Tstart: 50. C; Tend: 250. C |

References

Grosse, 1937
Grosse, A.V.,
Refractive Indices at Low Temperatures,
J. Am. Chem. Soc., 1937, 59, 2739-41. [all data]
Stephenson and Malanowski, 1987
Stephenson, Richard M.; Malanowski, Stanislaw,
Handbook of the Thermodynamics of Organic Compounds, 1987, https://doi.org/10.1007/978-94-009-3173-2
. [all data]
Li and Rossini, 1961
Li, J.C.M.; Rossini, F.D.,
Vapor Pressures and Boiling Points of the l-Fluoroalkanes, l-Chloroalkanes, l-Bromoalkanes, and l-Iodoalkanes, C 1 to C 20 .,
J. Chem. Eng. Data, 1961, 6, 2, 268-270, https://doi.org/10.1021/je60010a025
. [all data]
Dykyj, 1970
Dykyj, J.,
Petrochemica, 1970, 10, 2, 51. [all data]
Lacher, Kianpour, et al., 1956
Lacher, J.R.; Kianpour, A.; Park, J.D.,
Reaction heats of organic halogen compounds. VI. The catalytic hydrogenation of some alkyl fluorides,
J. Phys. Chem., 1956, 60, 1454-1455. [all data]
Cox and Pilcher, 1970
Cox, J.D.; Pilcher, G.,
Thermochemistry of Organic and Organometallic Compounds, Academic Press, New York, 1970, 1-636. [all data]
Kolesov and Kozina, 1986
Kolesov, V.P.; Kozina, M.P.,
Thermochemistry of organic and organohalogen compounds,
Russ. Chem. Rev., 1986, 55, 912. [all data]
Yamazaki, Katsumata, et al., 1973
Yamazaki, T.; Katsumata, S.; Kimura, K.,
Photoelectron spectra and orbital assignments by sum rule consideration: ethyl and n-propyl fluorides,
J. Electron Spectrosc. Relat. Phenom., 1973, 2, 335. [all data]
Zenkevich, 2005
Zenkevich, I.G.,
Experimentally measured retention indices., 2005. [all data]