1,3-Butadiyne
- Formula: C4H2
- Molecular weight: 50.0587
- IUPAC Standard InChIKey: LLCSWKVOHICRDD-UHFFFAOYSA-N
- CAS Registry Number: 460-12-8
- Chemical structure:
View 3d structure (requires JavaScript / HTML 5) - Isotopologues:
- Other names: Butadiyne; Biacetylene; Biethynyl; Diacetylene; HC≡CC≡CH; buta-1,3-diyne

Gas phase thermochemistry data

Data compiled as indicated in comments:
ALS - Hussein Y. Afeefy, Joel F. Liebman, and Stephen E. Stein
GT - Glushko Thermocenter, Russian Academy of Sciences, Moscow
Quantity | Value | Units | Method | Reference | Comment |
---|---|---|---|---|---|
ΔfH°gas | 464. | kJ/mol | Kin | Kiefer, Sidhu, et al., 1992 | ALS |
Constant pressure heat capacity of gas
Cp,gas (J/mol*K) | Temperature (K) | Reference | Comment |
---|---|---|---|
30.30 | 50. | Dorofeeva O.V., 1991 | Recommended values are in good agreement with other statistically calculated values [52FER/WER]. There is an appreciable difference with values calculated by [ Dessau L., 1988] because these authors used the estimated values of vibrational frequencies instead of experimental ones.; GT |
37.87 | 100. | ||
47.35 | 150. | ||
57.50 | 200. | ||
70.17 | 273.15 | ||
73.7 ± 1.0 | 298.15 | ||
73.92 | 300. | ||
84.43 | 400. | ||
91.51 | 500. | ||
96.86 | 600. | ||
101.26 | 700. | ||
105.05 | 800. | ||
108.38 | 900. | ||
111.33 | 1000. | ||
113.93 | 1100. | ||
116.24 | 1200. | ||
118.27 | 1300. | ||
120.06 | 1400. | ||
121.64 | 1500. | ||
123.04 | 1600. | ||
124.27 | 1700. | ||
125.37 | 1800. | ||
126.34 | 1900. | ||
127.20 | 2000. |

Phase change data

Data compiled as indicated in comments:
BS - Robert L. Brown and Stephen E. Stein
TRC - Thermodynamics Research Center, NIST Boulder Laboratories, Chris Muzny director
AC - William E. Acree, Jr., James S. Chickos
Quantity | Value | Units | Method | Reference | Comment |
---|---|---|---|---|---|
Tboil | 284. ± 3. | K | AVG | N/A | Average of 6 values; Individual data points |
Quantity | Value | Units | Method | Reference | Comment |
Tfus | 263. | K | N/A | Pauling, Springall, et al., 1939 | Uncertainty assigned by TRC = 2. K; TRC |
Tfus | 237.7 | K | N/A | Straus and Kollek, 1926 | Uncertainty assigned by TRC = 2.5 K; TRC |
Tfus | 237. | K | N/A | Mueller, 1925 | Uncertainty assigned by TRC = 3. K; TRC |
Enthalpy of vaporization
ΔvapH (kJ/mol) | Temperature (K) | Method | Reference | Comment |
---|---|---|---|---|
25.4 | 258. | N/A | Straus and Kollek, 2006 | Based on data from 195. to 273. K. See also Boublik, Fried, et al., 1984.; AC |
33.4 | 219. | N/A | Tanneberger, 2006 | Based on data from 188. to 234. K. See also Boublik, Fried, et al., 1984.; AC |
26.1 | 268. | A | Stephenson and Malanowski, 1987 | Based on data from 237. to 283. K. See also Dykyj, 1971.; AC |
26.4 | 267. | N/A | Stull, 1947 | Based on data from 191. to 282. K.; AC |
Antoine Equation Parameters
log10(P) = A − (B / (T + C))
P = vapor pressure (bar)
T = temperature (K)
View plot Requires a JavaScript / HTML 5 canvas capable browser.
Temperature (K) | A | B | C | Reference | Comment |
---|---|---|---|---|---|
190.7 to 282.9 | 3.05288 | 570.271 | -95.334 | Stull, 1947 | Coefficents calculated by NIST from author's data. |
195.0 to 273. | 2.64407 | 460.684 | -108.556 | Straus and Kollek, 1926, 2 | Coefficents calculated by NIST from author's data. |
Enthalpy of sublimation
ΔsubH (kJ/mol) | Temperature (K) | Method | Reference | Comment |
---|---|---|---|---|
36.3 | 188. to 234. | N/A | Tanneberger, 2006 | AC |
36.2 | 211. | A | Stull, 1947 | Based on data from 190. to 232. K.; AC |

Gas phase ion energetics data

Data evaluated as indicated in comments:
HL - Edward P. Hunter and Sharon G. Lias
Data compiled as indicated in comments:
B - John E. Bartmess
LLK - Sharon G. Lias, Rhoda D. Levin, and Sherif A. Kafafi
RDSH - Henry M. Rosenstock, Keith Draxl, Bruce W. Steiner, and John T. Herron
Quantity | Value | Units | Method | Reference | Comment |
---|---|---|---|---|---|
Proton affinity (review) | 737.2 | kJ/mol | N/A | Hunter and Lias, 1998 | HL |
Quantity | Value | Units | Method | Reference | Comment |
Gas basicity | 712.8 | kJ/mol | N/A | Hunter and Lias, 1998 | HL |
Ionization energy determinations
IE (eV) | Method | Reference | Comment |
---|---|---|---|
10.17 | PE | Bieri, Schmelzer, et al., 1980 | LLK |
10.17 ± 0.02 | PE | Bieri, Burger, et al., 1977 | LLK |
10.1 ± 0.1 | EI | Reeher, Flesch, et al., 1976 | LLK |
10.17 | PE | Brogli, Heilbronner, et al., 1973 | LLK |
10.180 ± 0.003 | S | Smith, 1967 | RDSH |
10.17 ± 0.01 | PE | Baker and Turner, Commun. 1967 | RDSH |
10.30 | PE | Bieri and Asbrink, 1980 | Vertical value; LLK |
Appearance energy determinations
Ion | AE (eV) | Other Products | Method | Reference | Comment |
---|---|---|---|---|---|
C2H+ | 20.1 ± 0.5 | C2H | EI | Coats and Anderson, 1957 | RDSH |
C4H+ | 12.1 ± 0.3 | H | EI | Coats and Anderson, 1957 | RDSH |
De-protonation reactions
C4H- + =
Quantity | Value | Units | Method | Reference | Comment |
---|---|---|---|---|---|
ΔrH° | 1507. ± 13. | kJ/mol | D-EA | Pino, Tulej, et al., 2002 | gas phase; B |
ΔrH° | 1508. ± 12. | kJ/mol | Endo | Shi and Ervin, 2000 | gas phase; B |
Quantity | Value | Units | Method | Reference | Comment |
ΔrG° | 1473. ± 14. | kJ/mol | H-TS | Pino, Tulej, et al., 2002 | gas phase; B |
ΔrG° | 1474. ± 13. | kJ/mol | H-TS | Shi and Ervin, 2000 | gas phase; B |

Henry's Law data

Data compiled by: Rolf Sander
Henry's Law constant (water solution)
kH(T) = k°H exp(d(ln(kH))/d(1/T) ((1/T) - 1/(298.15 K)))
k°H = Henry's law constant for solubility in water at 298.15 K (mol/(kg*bar))
d(ln(kH))/d(1/T) = Temperature dependence constant (K)
k°H (mol/(kg*bar)) | d(ln(kH))/d(1/T) (K) | Method | Reference | Comment |
---|---|---|---|---|
0.19 | Q | N/A | missing citation give several references for the Henry's law constants but don't assign them to specific species. |

Reaction thermochemistry data

Data compiled by: John E. Bartmess
Individual Reactions
C4H- + =
Quantity | Value | Units | Method | Reference | Comment |
---|---|---|---|---|---|
ΔrH° | 1507. ± 13. | kJ/mol | D-EA | Pino, Tulej, et al., 2002 | gas phase |
ΔrH° | 1508. ± 12. | kJ/mol | Endo | Shi and Ervin, 2000 | gas phase |
Quantity | Value | Units | Method | Reference | Comment |
ΔrG° | 1473. ± 14. | kJ/mol | H-TS | Pino, Tulej, et al., 2002 | gas phase |
ΔrG° | 1474. ± 13. | kJ/mol | H-TS | Shi and Ervin, 2000 | gas phase |

Kovats' RI, non-polar column, isothermal

Column type | Active phase | Temperature (C) | I | Reference | Comment |
---|---|---|---|---|---|
Capillary | CP Sil 5 CB | 20. | 431. | Do and Raulin, 1992 | 25. m/0.15 mm/2. μm, H2 |

Van Den Dool and Kratz RI, non-polar column, temperature ramp

Column type | Active phase | I | Reference | Comment |
---|---|---|---|---|
Capillary | DB-1 | 445. | Kaiser and Siegl, 1994 | 60. m/0.32 mm/1. μm, -50. C @ 4. min, 6. K/min; Tend: 180. C |

Normal alkane RI, non-polar column, temperature ramp

Column type | Active phase | I | Reference | Comment |
---|---|---|---|---|
Capillary | Polydimethyl siloxane: CP-Sil 5 CB | 428. | Bramston-Cook, 2013 | 60. m/0.25 mm/1.0 μm, Helium, 45. C @ 1.45 min, 3.6 K/min, 210. C @ 2.72 min |
Capillary | OV-101 | 430. | Zenkevich, 2005 | 25. m/0.20 mm/0.10 μm, N2/He, 6. K/min; Tstart: 50. C; Tend: 250. C |

Vibrational and/or electronic energy levels

Data compiled by: Takehiko Shimanouchi

Symmetry:   D∞h     Symmetry Number σ = 2

 Sym.   No   Approximate   Selected Freq.  Infrared   Raman   Comments
 Species   type of mode   Value   Rating   Value  Phase  Value  Phase

σg+ 1 CH str 3293  D  ia 3293 VW liq.
σg+ 2 C≡C str 2184  C  ia 2184 VS gas
σg+ 3 C-C str 874  C  ia 874 W gas
σu+ 4 CH str 3329  C 3329 VS gas  ia
σu+ 5 C≡C str 2020  C 2020 M gas  ia
πg 6 CH bend 627  C  ia 627 M gas
πg 7 CCC bend 482  C  ia 482 S gas
πu 8 CH bend 630  B 630 VS gas  ia
πu 9 CCC bend 231  E  ia 231 VW liq.

Source: Shimanouchi, 1972

References

Kiefer, Sidhu, et al., 1992
Kiefer, J.H.; Sidhu, S.S.; Kern, R.D.; Xie, K.; Chen, H.; Harding, L.B.,
The homogeneous pyrolysis of acetylene II: the high temperature radical chain mechanism,
Combust. Sci. Technol., 1992, 82, 101-130. [all data]
Dorofeeva O.V., 1991
Dorofeeva O.V.,
Thermodynamic properties of linear carbon chain molecules with conjugated triple bonds. Part I. Polyacetylenes, H(CC)nH (n=2-6), cyanopolyacetylenes, H(CC)nCN (n=1-5), and dicyanopolyacetylenes, NC(CC)nCN (n=1-4),
Thermochim. Acta, 1991, 178, 273-286. [all data]
Dessau L., 1988
Dessau L.,
Vibrations and thermodynamic functions of long-chain acetylenes,
Z. Phys. Chem. (Leipzig), 1988, 269, 187-190. [all data]
Pauling, Springall, et al., 1939
Pauling, L.; Springall, H.D.; Palmer, K.J.,
The Electron Diffraction Investigation of Methylacetylene, Dimethyl- acetylene, Dimethyldiacetylene, Methyl Cyanide, Diacetylene and Cyanogen cyanogen,
J. Am. Chem. Soc., 1939, 61, 927-8. [all data]
Straus and Kollek, 1926
Straus, F.; Kollek, L.,
About Diacetylene,
Ber. Dtsch. Chem. Ges., 1926, 59, 1664-81. [all data]
Mueller, 1925
Mueller, F.G.,
Diacetylene (1,3-butadiyne),
Helv. Chim. Acta, 1925, 8, 826-32. [all data]
Straus and Kollek, 2006
Straus, Fritz; Kollek, Leo,
Über Diacetylen,
Ber. dtsch. Chem. Ges. A/B, 2006, 59, 8, 1664-1681, https://doi.org/10.1002/cber.19260590804
. [all data]
Boublik, Fried, et al., 1984
Boublik, T.; Fried, V.; Hala, E.,
The Vapour Pressures of Pure Substances: Selected Values of the Temperature Dependence of the Vapour Pressures of Some Pure Substances in the Normal and Low Pressure Region, 2nd ed., Elsevier, New York, 1984, 972. [all data]
Tanneberger, 2006
Tanneberger, H.,
Einige Bemerkungen über die Dampfdruck-Kurve des Diacetylens (Butadiins).,
Ber. dtsch. Chem. Ges. A/B, 2006, 66, 4, 484-486, https://doi.org/10.1002/cber.19330660408
. [all data]
Stephenson and Malanowski, 1987
Stephenson, Richard M.; Malanowski, Stanislaw,
Handbook of the Thermodynamics of Organic Compounds, 1987, https://doi.org/10.1007/978-94-009-3173-2
. [all data]
Dykyj, 1971
Dykyj, J.,
Petrochemia, 1971, 11, 2, 27. [all data]
Stull, 1947
Stull, Daniel R.,
Vapor Pressure of Pure Substances. Organic and Inorganic Compounds,
Ind. Eng. Chem., 1947, 39, 4, 517-540, https://doi.org/10.1021/ie50448a022
. [all data]
Straus and Kollek, 1926, 2
Straus, F.; Kollek, L.,
Uber Diacetylen,
Ber. Dtsch. Chem. Ges., 1926, 59, 8, 1664-1681, https://doi.org/10.1002/cber.19260590804
. [all data]
Hunter and Lias, 1998
Hunter, E.P.; Lias, S.G.,
Evaluated Gas Phase Basicities and Proton Affinities of Molecules: An Update,
J. Phys. Chem. Ref. Data, 1998, 27, 3, 413-656, https://doi.org/10.1063/1.556018
. [all data]
Bieri, Schmelzer, et al., 1980
Bieri, G.; Schmelzer, A.; Asbrink, L.; Jonsson, M.,
Fluorine and the fluoroderivatives of acetylene and diacetylene studied by 30.4 nm He(II) photoelectron spectroscopy,
Chem. Phys., 1980, 49, 213. [all data]
Bieri, Burger, et al., 1977
Bieri, G.; Burger, F.; Heilbronner, E.; Maier, J.P.,
Valence ionization enrgies of hydrocarbons,
Helv. Chim. Acta, 1977, 60, 2213. [all data]
Reeher, Flesch, et al., 1976
Reeher, J.R.; Flesch, G.D.; Svec, H.J.,
The mass spectra and ionization potentials of the neutral fragments produced during the electron bombardment of aromatic compounds,
Org. Mass Spectrom., 1976, 11, 154. [all data]
Brogli, Heilbronner, et al., 1973
Brogli, F.; Heilbronner, E.; Hornung, V.; Kloster-Jensen, E.,
230. Die photoelektronen-spektren methyl-substituierter Acetylene,
Helv. Chim. Acta, 1973, 56, 2171. [all data]
Smith, 1967
Smith, W.L.,
The absorption spectrum of diacetylene in the vacuum ultraviolet,
Proc. Roy. Soc. (London), 1967, A300, 519. [all data]
Baker and Turner, Commun. 1967
Baker, C.; Turner, D.W.,
Photoelectron spectra of acetylene, diacetylene, and their deutero-derivatives,
Chem., Commun. 1967, 797. [all data]
Bieri and Asbrink, 1980
Bieri, G.; Asbrink, L.,
30.4-nm He(II) photoelectron spectra of organic molecules,
J. Electron Spectrosc. Relat. Phenom., 1980, 20, 149. [all data]
Coats and Anderson, 1957
Coats, F.H.; Anderson, R.C.,
Thermodynamic data from electron-impact measurements on acetylene and substituted acetylenes,
J. Am. Chem. Soc., 1957, 79, 1340. [all data]
Pino, Tulej, et al., 2002
Pino, T.; Tulej, M.; Guthe, F.; Pachkov, M.; Maier, J.P.,
Photodetachment spectroscopy of the C2nH- (n=2-4) anions in the vicinity of their electron detachment threshold,
J. Chem. Phys., 2002, 116, 14, 6126-6131, https://doi.org/10.1063/1.1451248
. [all data]
Shi and Ervin, 2000
Shi, Y.; Ervin, K.M.,
Gas-phase acidity and C-H bond energy of diacetylene,
Chem. Phys. Lett., 2000, 318, 1-3, 149-154, https://doi.org/10.1016/S0009-2614(00)00023-3
. [all data]