Glycine, ethyl ester
- Formula: C4H9NO2
- Molecular weight: 103.1198
- IUPAC Standard InChIKey: NTNZTEQNFHNYBC-UHFFFAOYSA-N
- CAS Registry Number: 459-73-4
- Chemical structure:
View 3d structure (requires JavaScript / HTML 5) - Other names: (Ethoxycarbonyl)methylamine; Ethyl 2-aminoacetate; Ethyl aminoacetate; Ethyl glycinate; Ethyl glycine; Aminoacetic acid, ethyl ester; Glicine, ethyl ester

Gas phase ion energetics data

Data compiled as indicated in comments:
LLK - Sharon G. Lias, Rhoda D. Levin, and Sherif A. Kafafi
Ionization energy determinations
IE (eV) | Method | Reference | Comment |
---|---|---|---|
8.8 | PE | Debies and Rabalais, 1974 | LLK |

References

Debies and Rabalais, 1974
Debies, T.P.; Rabalais, J.W.,
Electronic structure of amino acids and ureas,
J. Electron Spectrosc. Relat. Phenom., 1974, 3, 315. [all data]