Benzene, 1-(bromomethyl)-4-fluoro-
- Formula: C7H6BrF
- Molecular weight: 189.025
- IUPAC Standard InChIKey: NVNPLEPBDPJYRZ-UHFFFAOYSA-N
- CAS Registry Number: 459-46-1
- Chemical structure:
View 3d structure (requires JavaScript / HTML 5) - Other names: Toluene, α-bromo-p-fluoro-; p-Fluorobenzyl bromide; 4-Fluorobenzyl bromide; α-Bromo-4-fluorotoluene; α-bromo-p-fluorotoluene

Phase change data

Data compiled by: Robert L. Brown and Stephen E. Stein
Reduced pressure boiling point
Tboil (K) | Pressure (bar) | Reference |
---|---|---|
358.2 | 0.020 | Aldrich Chemical Company Inc., 1990 |

Gas phase ion energetics data

Data compiled by: Henry M. Rosenstock, Keith Draxl, Bruce W. Steiner, and John T. Herron
Appearance energy determinations
Ion | AE (eV) | Other Products | Method | Reference | Comment |
---|---|---|---|---|---|
C7H6F+ | 9.9 ± 0.1 | Br | EI | Tait, Shannon, et al., 1962 |

References

Aldrich Chemical Company Inc., 1990
Aldrich Chemical Company Inc.,
Catalog Handbook of Fine Chemicals, Aldrich Chemical Company, Inc., Milwaukee WI, 1990, 1. [all data]
Tait, Shannon, et al., 1962
Tait, J.M.S.; Shannon, T.W.; Harrison, A.G.,
The structure of substituted C7 ions from benzyl derivatives at the appearance potential threshold,
J. Am. Chem. Soc., 1962, 84, 4. [all data]