Phenyl trifluoromethyl ether
- Formula: C7H5F3O
- Molecular weight: 162.1092
- IUPAC Standard InChIKey: GQHWSLKNULCZGI-UHFFFAOYSA-N
- CAS Registry Number: 456-55-3
- Chemical structure:
View 3d structure (requires JavaScript / HTML 5) - Other names: Benzene, (trifluoromethoxy)-; Trifluoromethoxybenzene

Phase change data

Data compiled by: Robert L. Brown and Stephen E. Stein
Quantity | Value | Units | Method | Reference | Comment |
---|---|---|---|---|---|
Tboil | 371. to 373. | K | N/A | PCR Inc., 1990 |

Gas phase ion energetics data

Data compiled by: Henry M. Rosenstock, Keith Draxl, Bruce W. Steiner, and John T. Herron
Ionization energy determinations
IE (eV) | Method | Reference | Comment |
---|---|---|---|
10.00 | PE | Baker, May, et al., 1968 | Vertical value |

References

PCR Inc., 1990
PCR Inc.,
Research Chemicals Catalog 1990-1991, PCR Inc., Gainesville, FL, 1990, 1. [all data]
Baker, May, et al., 1968
Baker, A.D.; May, D.P.; Turner, D.W.,
Molecular photoelectron spectroscopy. Part VII. The vertical ionisation potentials of benzene and some of its monosubstituted and 1,4-disubstituted derivatives,
J. Chem. Soc. B, 1968, 22. [all data]