m-Fluoroanisole
- Formula: C7H7FO
- Molecular weight: 126.1283
- IUPAC Standard InChIKey: MFJNOXOAIFNSBX-UHFFFAOYSA-N
- CAS Registry Number: 456-49-5
- Chemical structure:
View 3d structure (requires JavaScript / HTML 5) - Other names: 3-Fluoroanisole; Benzene, 1-fluoro-3-methoxy-; Anisole, m-fluoro-

Phase change data

Data compiled as indicated in comments:
BS - Robert L. Brown and Stephen E. Stein
AC - William E. Acree, Jr., James S. Chickos
Quantity | Value | Units | Method | Reference | Comment |
---|---|---|---|---|---|
ΔvapH° | 48.1 ± 1.1 | kJ/mol | C | Ribeiro da Silva and Lobo Ferreira, 2009 | AC |
Reduced pressure boiling point
Tboil (K) | Pressure (bar) | Reference | Comment |
---|---|---|---|
431. | 0.991 | PCR Inc., 1990 | BS |
431.2 | 0.991 | Weast and Grasselli, 1989 | BS |

Reaction thermochemistry data

Data compiled by: John E. Bartmess
Individual Reactions
C7H6FO- + =
By formula: C7H6FO- + H+ = C7H7FO
Quantity | Value | Units | Method | Reference | Comment |
---|---|---|---|---|---|
ΔrH° | 1589. ± 13. | kJ/mol | G+TS | Ingemann and Nibbering, 1983 | gas phase; value altered from reference due to change in acidity scale |
Quantity | Value | Units | Method | Reference | Comment |
ΔrG° | 1556. ± 13. | kJ/mol | IMRB | Ingemann and Nibbering, 1983 | gas phase; value altered from reference due to change in acidity scale |

Gas phase ion energetics data

Data compiled as indicated in comments:
B - John E. Bartmess
MM - Michael M. Meot-Ner (Mautner)
LBLHLM - Sharon G. Lias, John E. Bartmess, Joel F. Liebman, John L. Holmes, Rhoda D. Levin, and W. Gary Mallard
RDSH - Henry M. Rosenstock, Keith Draxl, Bruce W. Steiner, and John T. Herron
Proton affinity at 298K
Proton affinity (kJ/mol) | Reference | Comment |
---|---|---|
825. | Bogdanov, van Duijn, et al., 2002 | MM |
Gas basicity at 298K
Gas basicity (review) (kJ/mol) | Reference | Comment |
---|---|---|
795. | Bogdanov, van Duijn, et al., 2002 | MM |
Ionization energy determinations
IE (eV) | Method | Reference | Comment |
---|---|---|---|
8.41 ± 0.06 | S | Oikawa, Abe, et al., 1985 | LBLHLM |
8.7 ± 0.1 | EI | Brown, 1970 | RDSH |
Appearance energy determinations
Ion | AE (eV) | Other Products | Method | Reference | Comment |
---|---|---|---|---|---|
C6H4OF+ | 12.5 ± 0.1 | CH3 | EI | Brown, 1970 | RDSH |
C6H5F+ | 11.8 ± 0.1 | CH2O | EI | Brown, 1970 | RDSH |
De-protonation reactions
C7H6FO- + =
By formula: C7H6FO- + H+ = C7H7FO
Quantity | Value | Units | Method | Reference | Comment |
---|---|---|---|---|---|
ΔrH° | 1589. ± 13. | kJ/mol | G+TS | Ingemann and Nibbering, 1983 | gas phase; value altered from reference due to change in acidity scale; B |
Quantity | Value | Units | Method | Reference | Comment |
ΔrG° | 1556. ± 13. | kJ/mol | IMRB | Ingemann and Nibbering, 1983 | gas phase; value altered from reference due to change in acidity scale; B |

Kovats' RI, non-polar column, isothermal

Column type | Active phase | Temperature (C) | I | Reference | Comment |
---|---|---|---|---|---|
Packed | Apiezon L | 180. | 925. | Vernon and Edwards, 1975 | N2, Celite; Column length: 1. m |

Kovats' RI, non-polar column, custom temperature program

Column type | Active phase | I | Reference | Comment |
---|---|---|---|---|
Packed | Apiezon M | 908.5 | Jalali-Heravi and Garkani-Nejad, 1993 | Chromosorb W; Column length: 2. m; Program: not specified |

References

Ribeiro da Silva and Lobo Ferreira, 2009
Ribeiro da Silva, Manuel A.V.; Lobo Ferreira, Ana I.M.C.,
Experimental and computational study on the molecular energetics of the three monofluoroanisole isomers,
The Journal of Chemical Thermodynamics, 2009, 41, 3, 361-366, https://doi.org/10.1016/j.jct.2008.09.012
. [all data]
PCR Inc., 1990
PCR Inc.,
Research Chemicals Catalog 1990-1991, PCR Inc., Gainesville, FL, 1990, 1. [all data]
Weast and Grasselli, 1989
CRC Handbook of Data on Organic Compounds, 2nd Editon, Weast,R.C and Grasselli, J.G., ed(s)., CRC Press, Inc., Boca Raton, FL, 1989, 1. [all data]
Ingemann and Nibbering, 1983
Ingemann, S.; Nibbering, N.M.M.,
Gas phase reactions of anions with 2-,3-, and 4-fluoroanisole,
J. Org. Chem., 1983, 48, 183. [all data]
Bogdanov, van Duijn, et al., 2002
Bogdanov, B.; van Duijn, D.; Ingemann, S.; Hammerum, S.,
Protonation of fluorophenols and fluoroanisoles in the gas phase: experiment and theory,
Phys. Chem. Chem. Phys., 2002, 4, 2904. [all data]
Oikawa, Abe, et al., 1985
Oikawa, A.; Abe, H.; Mikami, N.; Ito, M.,
Electronic spectra and ionization potentials of rotational isomers of severaldDisubstituted benzenes,
Chem. Phys. Lett., 1985, 116, 50. [all data]
Brown, 1970
Brown, P.,
Kinetic studies in mass spectrometry. VIII. Competing [M-CH3] and [M-CH2O] reactions in substituted anisoles. Approximate activation energies from ionization appearance potentials,
Org. Mass Spectrom., 1970, 4, 519. [all data]
Romm, et al., 1977
Romm, I.P., et al.,
Zhur. Obshchei Khim., 1977, 47, 975. [all data]
Vernon and Edwards, 1975
Vernon, F.; Edwards, G.T.,
Gas-liquid chromatography on fluorinated stationary phases. II. Fluorinated compounds containing a functional group,
J. Chromatogr., 1975, 114, 1, 87-93, https://doi.org/10.1016/S0021-9673(00)85245-0
. [all data]
Jalali-Heravi and Garkani-Nejad, 1993
Jalali-Heravi, M.; Garkani-Nejad, Z.,
Prediction of gas chromatographic retention indices of some benzene derivatives,
J. Chromatogr., 1993, 648, 2, 389-393, https://doi.org/10.1016/0021-9673(93)80421-4
. [all data]