Benzene, 1-(bromomethyl)-3-fluoro-
- Formula: C7H6BrF
- Molecular weight: 189.025
- IUPAC Standard InChIKey: SCBZBMXPJYMXRC-UHFFFAOYSA-N
- CAS Registry Number: 456-41-7
- Chemical structure:
View 3d structure (requires JavaScript / HTML 5) - Other names: Toluene, α-bromo-m-fluoro-; m-Fluorobenzylbromide; 3-Fluorobenzyl bromide; meta-Fluorobenzyl bromide; α-Bromo-3-fluorotoluene; α-bromo-m-fluorotoluene

Phase change data

Data compiled by: Robert L. Brown and Stephen E. Stein
Reduced pressure boiling point
Tboil (K) | Pressure (bar) | Reference |
---|---|---|
361.2 | 0.027 | Weast and Grasselli, 1989 |

Gas phase ion energetics data

Data compiled by: Henry M. Rosenstock, Keith Draxl, Bruce W. Steiner, and John T. Herron
Appearance energy determinations
Ion | AE (eV) | Other Products | Method | Reference | Comment |
---|---|---|---|---|---|
C7H6F+ | 9.9 ± 0.1 | Br | EI | Tait, Shannon, et al., 1962 |

References

Weast and Grasselli, 1989
CRC Handbook of Data on Organic Compounds, 2nd Editon, Weast,R.C and Grasselli, J.G., ed(s)., CRC Press, Inc., Boca Raton, FL, 1989, 1. [all data]
Tait, Shannon, et al., 1962
Tait, J.M.S.; Shannon, T.W.; Harrison, A.G.,
The structure of substituted C7 ions from benzyl derivatives at the appearance potential threshold,
J. Am. Chem. Soc., 1962, 84, 4. [all data]