Benzoic acid, 4-fluoro-
- Formula: C7H5FO2
- Molecular weight: 140.1118
- IUPAC Standard InChIKey: BBYDXOIZLAWGSL-UHFFFAOYSA-N
- CAS Registry Number: 456-22-4
- Chemical structure:
View 3d structure (requires JavaScript / HTML 5) - Other names: Benzoic acid, p-fluoro-; p-Fluorobenzoic acid; 4-Fluorobenzoic acid; para-Fluorobenzoic acid

Condensed phase thermochemistry data

Data compiled by: Hussein Y. Afeefy, Joel F. Liebman, and Stephen E. Stein
Quantity | Value | Units | Method | Reference | Comment |
---|---|---|---|---|---|
ΔfH°solid | -584.7 ± 0.9 | kJ/mol | Ccr | Johnson and Prosen, 1975 | |
ΔfH°solid | -584.9 | kJ/mol | Ccr | Cox, Gundry, et al., 1964 | |
ΔfH°solid | -586.8 ± 1.6 | kJ/mol | Ccr | Good, Scott, et al., 1956 | Corrected for CODATA value of ΔfH |
Quantity | Value | Units | Method | Reference | Comment |
ΔcH°solid | -3063.8 ± 0.8 | kJ/mol | Ccr | Johnson and Prosen, 1975 | |
ΔcH°solid | -3063.2 ± 0.88 | kJ/mol | Ccr | Cox, Gundry, et al., 1964 | |
ΔcH°solid | -3061.5 ± 1.2 | kJ/mol | Ccr | Good, Scott, et al., 1956 | Corrected for CODATA value of ΔfH |
ΔcH°solid | -3094.7 | kJ/mol | Ccb | Swarts, 1919 | Not corrected for CODATA value of ΔfH |

Phase change data

Data compiled as indicated in comments:
ALS - Hussein Y. Afeefy, Joel F. Liebman, and Stephen E. Stein
AC - William E. Acree, Jr., James S. Chickos
Quantity | Value | Units | Method | Reference | Comment |
---|---|---|---|---|---|
ΔsubH° | 91.3 ± 3.0 | kJ/mol | V | Cox, Gundry, et al., 1969 | ALS |
ΔsubH° | 93.1 ± 3.8 | kJ/mol | N/A | Cox, Gundry, et al., 1969 | See also Monte and Hillesheim, 2000.; AC |
Enthalpy of sublimation
ΔsubH (kJ/mol) | Temperature (K) | Method | Reference | Comment |
---|---|---|---|---|
91.2 ± 1.3 | 370. | GS | Cox, Gundry, et al., 1969 | Based on data from 358. to 382. K. See also Cox and Pilcher, 1970 and Stephenson and Malanowski, 1987.; AC |
Enthalpy of fusion
ΔfusH (kJ/mol) | Temperature (K) | Reference | Comment |
---|---|---|---|
20.9 | 451.2 | Kang and Samulski, 2000 | AC |

Reaction thermochemistry data

Data compiled by: John E. Bartmess
Individual Reactions
C7H4FO2- + =
By formula: C7H4FO2- + H+ = C7H5FO2
Quantity | Value | Units | Method | Reference | Comment |
---|---|---|---|---|---|
ΔrH° | 1410. ± 8.8 | kJ/mol | G+TS | Kebarle and McMahon, 1977 | gas phase |
Quantity | Value | Units | Method | Reference | Comment |
ΔrG° | 1381. ± 8.4 | kJ/mol | IMRE | Kebarle and McMahon, 1977 | gas phase |

Gas phase ion energetics data

Data compiled as indicated in comments:
B - John E. Bartmess
LLK - Sharon G. Lias, Rhoda D. Levin, and Sherif A. Kafafi
Ionization energy determinations
IE (eV) | Method | Reference | Comment |
---|---|---|---|
9.9 ± 0.2 | EI | Benoit, 1973 | LLK |
Appearance energy determinations
Ion | AE (eV) | Other Products | Method | Reference | Comment |
---|---|---|---|---|---|
C6H4F+ | 15.3 ± 0.2 | CO+OH | EI | Benoit, 1973 | LLK |
C7H4OF+ | 12.3 ± 0.2 | OH | EI | Benoit, 1973 | LLK |
De-protonation reactions
C7H4FO2- + =
By formula: C7H4FO2- + H+ = C7H5FO2
Quantity | Value | Units | Method | Reference | Comment |
---|---|---|---|---|---|
ΔrH° | 1410. ± 8.8 | kJ/mol | G+TS | Kebarle and McMahon, 1977 | gas phase; B |
Quantity | Value | Units | Method | Reference | Comment |
ΔrG° | 1381. ± 8.4 | kJ/mol | IMRE | Kebarle and McMahon, 1977 | gas phase; B |

References

Johnson and Prosen, 1975
Johnson, W.H.; Prosen, E.J.,
Enthalpies of combustion and formation of ortho- and parafluorobenzoic acid,
J. Res. Natl. Bur. Stand. Sect. A:, 1975, 79, 481-486. [all data]
Cox, Gundry, et al., 1964
Cox, J.D.; Gundry, H.A.; Head, A.J.,
Thermodynamic properties of fluorine compounds. Part 1.-Heats of combustion of p-fluorobenzoic acid, pentafluorobenzoic acid, hexafluorobenzene and decafluorocyclohexene,
Trans. Faraday Soc., 1964, 60, 653-665. [all data]
Good, Scott, et al., 1956
Good, W.D.; Scott, D.W.; Waddington, G.,
Combustion calorimetry of organic fluorine compounds by a rotating-bomb method,
J. Phys. Chem., 1956, 60, 1080-1089. [all data]
Swarts, 1919
Swarts, F.,
Etudes thermochimiques sur les combinaisons organiques fluorees,
J. Chim. Phys., 1919, 17, 3-70. [all data]
Cox, Gundry, et al., 1969
Cox, J.D.; Gundry, H.A.; Harrop, D.; Head, A.J.,
Thermodynamic properties of fluorine compounds. 9. Enthalpies of formation of some compounds containing the pentafluorophenyl group,
J. Chem. Thermodyn., 1969, 1, 77-87. [all data]
Monte and Hillesheim, 2000
Monte, Manuel J.S.; Hillesheim, Dorothea M.,
Thermodynamic study on the sublimation of the three iodobenzoic acids and of 2-fluoro- and 3-fluorobenzoic acids,
The Journal of Chemical Thermodynamics, 2000, 32, 12, 1727-1735, https://doi.org/10.1006/jcht.2000.0705
. [all data]
Cox and Pilcher, 1970
Cox, J.D.; Pilcher, G.,
Thermochemistry of Organic and Organometallic Compounds, Academic Press Inc., London, 1970, 643. [all data]
Stephenson and Malanowski, 1987
Stephenson, Richard M.; Malanowski, Stanislaw,
Handbook of the Thermodynamics of Organic Compounds, 1987, https://doi.org/10.1007/978-94-009-3173-2
. [all data]
Kang and Samulski, 2000
Kang, Seung Koo; Samulski, Edward T.,
Liquid crystals comprising hydrogen-bonded organic acids I. Mixtures of non-mesogenic acids,
Liquid Crystals, 2000, 27, 3, 371-376, https://doi.org/10.1080/026782900202822
. [all data]
Kebarle and McMahon, 1977
Kebarle, P.; McMahon, T.B.,
Intrinsic Acidities of Substituted Phenols and Benzoic Acids Determined by Gas Phase Proton Transfer Equilibria,
J. Am. Chem. Soc., 1977, 99, 7, 2222, https://doi.org/10.1021/ja00449a032
. [all data]
Benoit, 1973
Benoit, F.,
Substituent effects in mass spectrometry. III. Substituent effects in the dissociation of the molecular ions of para and meta subtituted benzoic acids,
Org. Mass Spectrom., 1973, 7, 295. [all data]