Benzoic acid, 3-fluoro-
- Formula: C7H5FO2
- Molecular weight: 140.1118
- IUPAC Standard InChIKey: MXNBDFWNYRNIBH-UHFFFAOYSA-N
- CAS Registry Number: 455-38-9
- Chemical structure:
View 3d structure (requires JavaScript / HTML 5) - Other names: Benzoic acid, m-fluoro-; m-Fluorobenzoic acid; 3-Fluorobenzoic acid; meta-Fluorobenzoic acid

Condensed phase thermochemistry data

Data compiled by: Hussein Y. Afeefy, Joel F. Liebman, and Stephen E. Stein
Quantity | Value | Units | Method | Reference | Comment |
---|---|---|---|---|---|
ΔfH°solid | -582.2 ± 1.3 | kJ/mol | Ccr | Good, Scott, et al., 1956 | Corrected for CODATA value of ΔfH |
Quantity | Value | Units | Method | Reference | Comment |
ΔcH°solid | -3066.1 ± 0.84 | kJ/mol | Ccr | Good, Scott, et al., 1956 | Corrected for CODATA value of ΔfH |
ΔcH°solid | -3085.9 | kJ/mol | Ccb | Swarts, 1919 | Not corrected for CODATA value of ΔfH |

Phase change data

Data compiled by: William E. Acree, Jr., James S. Chickos
Quantity | Value | Units | Method | Reference | Comment |
---|---|---|---|---|---|
ΔsubH° | 93.6 ± 0.6 | kJ/mol | N/A | Monte and Hillesheim, 2000 |
Enthalpy of sublimation
ΔsubH (kJ/mol) | Temperature (K) | Method | Reference | Comment |
---|---|---|---|---|
93.3 ± 0.5 | 310. | ME | Monte and Hillesheim, 2000 | Based on data from 303. to 317. K. |

Reaction thermochemistry data

Data compiled by: John E. Bartmess
Individual Reactions
C7H4FO2- + =
By formula: C7H4FO2- + H+ = C7H5FO2
Quantity | Value | Units | Method | Reference | Comment |
---|---|---|---|---|---|
ΔrH° | 1406. ± 8.8 | kJ/mol | G+TS | Kebarle and McMahon, 1977 | gas phase |
Quantity | Value | Units | Method | Reference | Comment |
ΔrG° | 1377. ± 8.4 | kJ/mol | IMRE | Kebarle and McMahon, 1977 | gas phase |

Gas phase ion energetics data

Data compiled as indicated in comments:
B - John E. Bartmess
LLK - Sharon G. Lias, Rhoda D. Levin, and Sherif A. Kafafi
Ionization energy determinations
IE (eV) | Method | Reference | Comment |
---|---|---|---|
9.9 ± 0.2 | EI | Benoit, 1973 | LLK |
Appearance energy determinations
Ion | AE (eV) | Other Products | Method | Reference | Comment |
---|---|---|---|---|---|
C6H4F+ | 15.3 ± 0.2 | CO+OH | EI | Benoit, 1973 | LLK |
C7H4OF+ | 12.5 ± 0.2 | OH | EI | Benoit, 1973 | LLK |
De-protonation reactions
C7H4FO2- + =
By formula: C7H4FO2- + H+ = C7H5FO2
Quantity | Value | Units | Method | Reference | Comment |
---|---|---|---|---|---|
ΔrH° | 1406. ± 8.8 | kJ/mol | G+TS | Kebarle and McMahon, 1977 | gas phase; B |
Quantity | Value | Units | Method | Reference | Comment |
ΔrG° | 1377. ± 8.4 | kJ/mol | IMRE | Kebarle and McMahon, 1977 | gas phase; B |

References

Good, Scott, et al., 1956
Good, W.D.; Scott, D.W.; Waddington, G.,
Combustion calorimetry of organic fluorine compounds by a rotating-bomb method,
J. Phys. Chem., 1956, 60, 1080-1089. [all data]
Swarts, 1919
Swarts, F.,
Etudes thermochimiques sur les combinaisons organiques fluorees,
J. Chim. Phys., 1919, 17, 3-70. [all data]
Monte and Hillesheim, 2000
Monte, Manuel J.S.; Hillesheim, Dorothea M.,
Thermodynamic study on the sublimation of the three iodobenzoic acids and of 2-fluoro- and 3-fluorobenzoic acids,
The Journal of Chemical Thermodynamics, 2000, 32, 12, 1727-1735, https://doi.org/10.1006/jcht.2000.0705
. [all data]
Kebarle and McMahon, 1977
Kebarle, P.; McMahon, T.B.,
Intrinsic Acidities of Substituted Phenols and Benzoic Acids Determined by Gas Phase Proton Transfer Equilibria,
J. Am. Chem. Soc., 1977, 99, 7, 2222, https://doi.org/10.1021/ja00449a032
. [all data]
Benoit, 1973
Benoit, F.,
Substituent effects in mass spectrometry. III. Substituent effects in the dissociation of the molecular ions of para and meta subtituted benzoic acids,
Org. Mass Spectrom., 1973, 7, 295. [all data]
Lang (editor), 1968
Lang (editor), L.,
Absorption Spectra in the Ultraviolet and Visible Region, 1968, 11, 82. [all data]