Benzonitrile, 4-(trifluoromethyl)-
- Formula: C8H4F3N
- Molecular weight: 171.1193
- IUPAC Standard InChIKey: DRNJIKRLQJRKMM-UHFFFAOYSA-N
- CAS Registry Number: 455-18-5
- Chemical structure:
View 3d structure (requires JavaScript / HTML 5) - Other names: p-Cyanobenzotrifluoride; p-Tolunitrile, α,α,α-trifluoro-; p-(Trifluoromethyl)benzonitrile; 4-Trifluoromethylbenzonitrile; α,α,α-Trifluoro-p-toluonitrile; Benzonitrile, p-(trifluoromethyl)-; p-Tolunitrile, alpha,alpha,alpha-trifluoro-; 4-Trifluoromethylbenzoic acid nitrile; α,α,α-trifluoro-4-toluonitrile

Phase change data

Data compiled by: Robert L. Brown and Stephen E. Stein
Reduced pressure boiling point
Tboil (K) | Pressure (bar) | Reference |
---|---|---|
353.7 | 0.027 | Aldrich Chemical Company Inc., 1990 |
353. to 354. | 0.027 | PCR Inc., 1990 |

Gas phase ion energetics data

Data evaluated as indicated in comments:
HL - Edward P. Hunter and Sharon G. Lias
Data compiled as indicated in comments:
RDSH - Henry M. Rosenstock, Keith Draxl, Bruce W. Steiner, and John T. Herron
B - John E. Bartmess
Quantity | Value | Units | Method | Reference | Comment |
---|---|---|---|---|---|
Proton affinity (review) | 787.2 | kJ/mol | N/A | Hunter and Lias, 1998 | HL |
Quantity | Value | Units | Method | Reference | Comment |
Gas basicity | 758.3 | kJ/mol | N/A | Hunter and Lias, 1998 | HL |
Electron affinity determinations
EA (eV) | Method | Reference | Comment |
---|---|---|---|
0.759 ± 0.087 | TDEq | Chowdhury and Kebarle, 1986 | ΔGea(423 K) = -18.6 kcal/mol; ΔSea = +2.6 eu.; B |
Ionization energy determinations
IE (eV) | Method | Reference | Comment |
---|---|---|---|
10.61 ± 0.05 | EI | Buchs, 1970 | RDSH |

References

Aldrich Chemical Company Inc., 1990
Aldrich Chemical Company Inc.,
Catalog Handbook of Fine Chemicals, Aldrich Chemical Company, Inc., Milwaukee WI, 1990, 1. [all data]
PCR Inc., 1990
PCR Inc.,
Research Chemicals Catalog 1990-1991, PCR Inc., Gainesville, FL, 1990, 1. [all data]
Hunter and Lias, 1998
Hunter, E.P.; Lias, S.G.,
Evaluated Gas Phase Basicities and Proton Affinities of Molecules: An Update,
J. Phys. Chem. Ref. Data, 1998, 27, 3, 413-656, https://doi.org/10.1063/1.556018
. [all data]
Chowdhury and Kebarle, 1986
Chowdhury, S.; Kebarle, P.,
Electron affinities of di- and tetracyanoethylene and cyanobenzenes based on measurements of gas-phase electron transfer equilibria,
J. Am. Chem. Soc., 1986, 108, 5453. [all data]
Buchs, 1970
Buchs, A.,
Etude par spectrometrie de masse de l'ionisation de benzonitriles, de phenylacetonitriles et de N,N-dimethylanilines substitues,
Helv. Chim. Acta, 1970, 53, 2026. [all data]