1H-Indene, octahydro-, cis-
- Formula: C9H16
- Molecular weight: 124.2233
- IUPAC Standard InChIKey: BNRNAKTVFSZAFA-DTORHVGOSA-N
- CAS Registry Number: 4551-51-3
- Chemical structure:
View 3d structure (requires JavaScript / HTML 5) - Stereoisomers:
- Other names: Indan, hexahydro-, cis-; cis-Bicyclo[4.3.0]Nonane; cis-Hexahydroindan; cis-Hydrindan; cis-Perhydroindene; cis-Octahydro-1H-indene; Octahydro-1H-indene, cis; cis-Hydrindane; Indene, octahydro-, cis-; cis-hexahydrindan

Gas phase thermochemistry data

Data compiled as indicated in comments:
ALS - Hussein Y. Afeefy, Joel F. Liebman, and Stephen E. Stein
GT - Glushko Thermocenter, Russian Academy of Sciences, Moscow
Quantity | Value | Units | Method | Reference | Comment |
---|---|---|---|---|---|
ΔfH°gas | -127.2 ± 2.0 | kJ/mol | Ccb | Browne and Rossini, 1960 | ALS |
Constant pressure heat capacity of gas
Cp,gas (J/mol*K) | Temperature (K) | Reference | Comment |
---|---|---|---|
149.58 | 298.15 | Chang S., 1970 | These values were calculated by a method of force field; their uncertainties may exceed 5-10 J/mol*K.; GT |
210.20 | 400. | ||
265.47 | 500. |

Condensed phase thermochemistry data

Data compiled as indicated in comments:
ALS - Hussein Y. Afeefy, Joel F. Liebman, and Stephen E. Stein
DH - Eugene S. Domalski and Elizabeth D. Hearing
Quantity | Value | Units | Method | Reference | Comment |
---|---|---|---|---|---|
ΔfH°liquid | -173.3 ± 1.5 | kJ/mol | Ccb | Browne and Rossini, 1960 | ALS |
Quantity | Value | Units | Method | Reference | Comment |
ΔcH°liquid | -5655.1 ± 1.5 | kJ/mol | Ccb | Browne and Rossini, 1960 | Corresponding ΔfHºliquid = -173.1 kJ/mol (simple calculation by NIST; no Washburn corrections); ALS |
ΔcH°liquid | -5646.7 ± 5.9 | kJ/mol | Ccb | Huckel, Kamenz, et al., 1937 | Reanalyzed by Cox and Pilcher, 1970, Original value = -5640. ± 20. kJ/mol; Corresponding ΔfHºliquid = -181.5 kJ/mol (simple calculation by NIST; no Washburn corrections); ALS |
Quantity | Value | Units | Method | Reference | Comment |
S°liquid | 265.47 | J/mol*K | N/A | Finke, McCullough, et al., 1972 | DH |
Constant pressure heat capacity of liquid
Cp,liquid (J/mol*K) | Temperature (K) | Reference | Comment |
---|---|---|---|
214.18 | 298.15 | Finke, McCullough, et al., 1972 | T = 10 to 370 K.; DH |

Phase change data

Data compiled as indicated in comments:
TRC - Thermodynamics Research Center, NIST Boulder Laboratories, Chris Muzny director
ALS - Hussein Y. Afeefy, Joel F. Liebman, and Stephen E. Stein
DRB - Donald R. Burgess, Jr.
AC - William E. Acree, Jr., James S. Chickos
CAL - James S. Chickos, William E. Acree, Jr., Joel F. Liebman, Students of Chem 202 (Introduction to the Literature of Chemistry), University of Missouri -- St. Louis
DH - Eugene S. Domalski and Elizabeth D. Hearing
Quantity | Value | Units | Method | Reference | Comment |
---|---|---|---|---|---|
Tboil | 441. ± 2. | K | AVG | N/A | Average of 9 values; Individual data points |
Quantity | Value | Units | Method | Reference | Comment |
Tfus | 236.3 ± 0.3 | K | AVG | N/A | Average of 8 values; Individual data points |
Quantity | Value | Units | Method | Reference | Comment |
Ttriple | 236.48 | K | N/A | Finke, McCullough, et al., 1972, 2 | Crystal phase 1 phase; Uncertainty assigned by TRC = 0.01 K; TRC |
Quantity | Value | Units | Method | Reference | Comment |
ΔvapH° | 46.0 ± 1.3 | kJ/mol | V | Browne and Rossini, 1960 | ALS |
ΔvapH° | 46.1 | kJ/mol | N/A | Browne and Rossini, 1960 | DRB |
Enthalpy of vaporization
ΔvapH (kJ/mol) | Temperature (K) | Method | Reference | Comment |
---|---|---|---|---|
47.1 | 278. | A | Stephenson and Malanowski, 1987 | Based on data from 263. to 293. K.; AC |
45.9 | 305. | A | Stephenson and Malanowski, 1987 | Based on data from 290. to 366. K.; AC |
41.9 | 378. | A | Stephenson and Malanowski, 1987 | Based on data from 363. to 463. K.; AC |
42.6 | 365. | GS | Camin and Rossini, 1955 | Based on data from 350. to 442. K.; AC |
Enthalpy of fusion
ΔfusH (kJ/mol) | Temperature (K) | Reference | Comment |
---|---|---|---|
1.4 | 236.5 | Finke, McCullough, et al., 1972 | AC |
Entropy of fusion
ΔfusS (J/mol*K) | Temperature (K) | Reference | Comment |
---|---|---|---|
45.33 | 182.3 | Finke, McCullough, et al., 1972, 3 | CAL |
2.13 | 184.5 | ||
5.91 | 236.5 |
Enthalpy of phase transition
ΔHtrs (kJ/mol) | Temperature (K) | Initial Phase | Final Phase | Reference | Comment |
---|---|---|---|---|---|
8.2626 | 182.28 | crystaline, III | crystaline, II | Finke, McCullough, et al., 1972 | DH |
0.3950 | 184.9 | crystaline, II | crystaline, I | Finke, McCullough, et al., 1972 | DH |
1.3970 | 236.48 | crystaline, I | liquid | Finke, McCullough, et al., 1972 | DH |
Entropy of phase transition
ΔStrs (J/mol*K) | Temperature (K) | Initial Phase | Final Phase | Reference | Comment |
---|---|---|---|---|---|
45.33 | 182.28 | crystaline, III | crystaline, II | Finke, McCullough, et al., 1972 | DH |
2.14 | 184.9 | crystaline, II | crystaline, I | Finke, McCullough, et al., 1972 | DH |
5.91 | 236.48 | crystaline, I | liquid | Finke, McCullough, et al., 1972 | DH |

Reaction thermochemistry data

Data compiled by: Hussein Y. Afeefy, Joel F. Liebman, and Stephen E. Stein
Individual Reactions
By formula: C9H16 = C9H16
Quantity | Value | Units | Method | Reference | Comment |
---|---|---|---|---|---|
ΔrH° | -3.10 | kJ/mol | Eqk | Finke, McCullough, et al., 1972 | liquid phase |
ΔrH° | -2.4 ± 0.2 | kJ/mol | Eqk | Blanchard and Schleyer, 1963 | liquid phase; Heat of isomerization |
ΔrH° | -4.5 ± 0.4 | kJ/mol | Eqk | Allinger and Coke, 1960 | liquid phase |
By formula: 8H2 + 2C9H8 = C9H16 + C9H16
Quantity | Value | Units | Method | Reference | Comment |
---|---|---|---|---|---|
ΔrH° | -585.2 ± 4.2 | kJ/mol | Chyd | Dolliver, Gresham, et al., 1937 | gas phase; Reanalyzed by Cox and Pilcher, 1970, Original value = -587.4 ± 4.2 kJ/mol; At 355 °K |
By formula: 6H2 + 2C9H10 = C9H16 + C9H16
Quantity | Value | Units | Method | Reference | Comment |
---|---|---|---|---|---|
ΔrH° | -377.1 ± 2.1 | kJ/mol | Chyd | Dolliver, Gresham, et al., 1937 | gas phase; Reanalyzed by Cox and Pilcher, 1970, Original value = -383. ± 2. kJ/mol; At 355 °K |
By formula: 3H2 + C9H10 = C9H16
Quantity | Value | Units | Method | Reference | Comment |
---|---|---|---|---|---|
ΔrH° | -192. | kJ/mol | Eqk | Frye and Weitkamp, 1969 | gas phase |
By formula: C9H16 = C9H16
Quantity | Value | Units | Method | Reference | Comment |
---|---|---|---|---|---|
ΔrH° | 4.456 | kJ/mol | Eqk | Finke, McCullough, et al., 1972 | gas phase |

Gas phase ion energetics data

Data compiled as indicated in comments:
LLK - Sharon G. Lias, Rhoda D. Levin, and Sherif A. Kafafi
RDSH - Henry M. Rosenstock, Keith Draxl, Bruce W. Steiner, and John T. Herron
Ionization energy determinations
IE (eV) | Method | Reference | Comment |
---|---|---|---|
9.46 ± 0.06 | PI | Mikaya and Zaikin, 1980 | LLK |
9.497 ± 0.003 | EI | Mikaya and Zaikin, 1980 | LLK |
10.13 ± 0.03 | EI | Natalis, 1963 | RDSH |
Appearance energy determinations
Ion | AE (eV) | Other Products | Method | Reference | Comment |
---|---|---|---|---|---|
C5H7+ | 12.21 ± 0.05 | C2H5+C2H4 | EI | Natalis, 1963 | RDSH |
C6H9+ | 11.99 ± 0.05 | ? | EI | Natalis, 1963 | RDSH |
C6H10+ | 10.79 ± 0.03 | C3H6 | EI | Natalis, 1963 | RDSH |
C7H11+ | 11.71 ± 0.05 | C2H5 | EI | Natalis, 1963 | RDSH |
C7H12+ | 10.96 ± 0.03 | C2H4 | EI | Natalis, 1963 | RDSH |

Kovats' RI, non-polar column, isothermal

Column type | Active phase | Temperature (C) | I | Reference | Comment |
---|---|---|---|---|---|
Packed | C78, Branched paraffin | 130. | 1035.6 | Dallos, Sisak, et al., 2000 | He; Column length: 3.3 m |
Packed | SE-30 | 120. | 998. | Kowalski, 1992 | He, Gas Chrom Q (100-120 mesh); Column length: 0.25 m |
Packed | C78, Branched paraffin | 130. | 1033.1 | Reddy, Dutoit, et al., 1992 | Chromosorb G HP; Column length: 3.3 m |
Packed | OV-101 | 150. | 1012.7 | Maeck, Touabet, et al., 1989 | N2, Chromosorb G HP; Column length: 2. m |
Packed | OV-101 | 120. | 1004. | Fernández-Sánchez, Fernández-Torres, et al., 1987 | N2, Chromosorb W AW DMCS (80-100 mesh); Column length: 2. m |
Packed | Squalane | 80. | 989. | Kersten and Poole, 1987 | N2; Column length: 3.5 m |
Capillary | SE-30 | 70. | 980.9 | Tóth, 1983 | N2; Column length: 15. m; Column diameter: 0.25 mm |
Capillary | SE-30 | 130. | 1012. | Bredael, 1982 | Column length: 100. m; Column diameter: 0.5 mm |
Capillary | SE-30 | 150. | 1022. | Bredael, 1982 | Column length: 100. m; Column diameter: 0.5 mm |
Capillary | SE-30 | 80. | 987. | Bredael, 1982 | Column length: 100. m; Column diameter: 0.5 mm |
Capillary | Squalane | 90. | 991. | Engewald, Epsch, et al., 1976 | N2; Column length: 100. m; Column diameter: 0.23 mm |

Kovats' RI, polar column, isothermal

Column type | Active phase | Temperature (C) | I | Reference | Comment |
---|---|---|---|---|---|
Packed | Carbowax 20M | 120. | 1156. | Fernández-Sánchez, Fernández-Torres, et al., 1987 | N2, Chromosorb W AW DMCS; Column length: 2. m |
Packed | Carbowax 20M | 80. | 1111. | Kersten and Poole, 1987 | N2, Chromosorb W-AW; Column length: 3.5 m |
Capillary | PEG-20M | 70. | 1107.3 | Tóth, 1983 | N2; Column length: 30. m; Column diameter: 0.3 mm |

Van Den Dool and Kratz RI, non-polar column, temperature ramp

Column type | Active phase | I | Reference | Comment |
---|---|---|---|---|
Capillary | DB-5 | 981.0 | Song, Lai, et al., 2003 | 30. m/0.25 mm/0.25 μm, He, 2. K/min; Tstart: 40. C; Tend: 310. C |
Capillary | DB-5 | 985.8 | Song, Lai, et al., 2003 | 30. m/0.25 mm/0.25 μm, He, 4. K/min; Tstart: 40. C; Tend: 310. C |
Capillary | DB-5 | 989.5 | Song, Lai, et al., 2003 | 30. m/0.25 mm/0.25 μm, He, 6. K/min; Tstart: 40. C; Tend: 310. C |
Capillary | DB-5 | 981. | Lai and Song, 1995 | 30. m/0.25 mm/0.25 μm, He, 2. K/min; Tstart: 40. C; Tend: 310. C |
Capillary | DB-5 | 985.8 | Lai and Song, 1995 | 30. m/0.25 mm/0.25 μm, He, 4. K/min; Tstart: 40. C; Tend: 310. C |
Capillary | DB-5 | 989.5 | Lai and Song, 1995 | 30. m/0.25 mm/0.25 μm, He, 6. K/min; Tstart: 40. C; Tend: 310. C |
Capillary | Petrocol DH | 979. | White, Hackett, et al., 1992 | 100. m/0.25 mm/0.5 μm, He, 1. K/min; Tstart: 30. C; Tend: 220. C |

Normal alkane RI, non-polar column, isothermal

Column type | Active phase | Temperature (C) | I | Reference | Comment |
---|---|---|---|---|---|
Capillary | Polydimethyl siloxane | 105. | 997. | Tello, Lebron-Aguilar, et al., 2009 | |
Capillary | Polydimethyl siloxane | 75. | 980. | Tello, Lebron-Aguilar, et al., 2009 | |
Capillary | Polydimethyl siloxane | 90. | 990. | Tello, Lebron-Aguilar, et al., 2009 | |
Packed | Polydimethyl siloxane | 120. | 1005. | Tello, Lebron-Aguilar, et al., 2009 | |
Packed | Polydimethyl siloxane | 120. | 1005. | Tello, Lebron-Aguilar, et al., 2009 | |
Packed | Polydimethyl siloxane | 120. | 1005. | Tello, Lebron-Aguilar, et al., 2009 | |
Capillary | Methyl Silicone | 100. | 994. | Lebrón-Aguilar, Quintanilla-López, et al., 2007 | |
Capillary | Methyl Silicone | 120. | 1005. | Lebrón-Aguilar, Quintanilla-López, et al., 2007 | |
Capillary | Methyl Silicone | 140. | 1015. | Lebrón-Aguilar, Quintanilla-López, et al., 2007 | |
Capillary | Methyl Silicone | 80. | 985. | Lebrón-Aguilar, Quintanilla-López, et al., 2007 | |
Capillary | Methyl Silicone | 120. | 1005. | Lebrón-Aguilar, Quintanilla-López, et al., 2007 | |
Capillary | Methyl Silicone | 120. | 1005. | Lebrón-Aguilar, Quintanilla-López, et al., 2007 | |
Capillary | Methyl Silicone | 120. | 1005. | Lebrón-Aguilar, Quintanilla-López, et al., 2007 | |
Packed | Polydimethyl siloxane | 110. | 996. | Ferrand, 1962 |

Normal alkane RI, non-polar column, temperature ramp

Column type | Active phase | I | Reference | Comment |
---|---|---|---|---|
Capillary | Petrocol DH | 984. | Supelco, 2012 | 100. m/0.25 mm/0.50 μm, Helium, 20. C @ 15. min, 15. K/min, 220. C @ 30. min |

Normal alkane RI, non-polar column, custom temperature program

Column type | Active phase | I | Reference | Comment |
---|---|---|---|---|
Capillary | Polymethylsiloxane, (PMS-20000) | 981. | Cornwell and Cordano, 2003 | Program: not specified |
Capillary | OV-1 | 975. | Waggott and Davies, 1984 | Hydrogen; Column length: 50. m; Column diameter: 0.32 mm; Program: not specified |

Normal alkane RI, polar column, custom temperature program

Column type | Active phase | I | Reference | Comment |
---|---|---|---|---|
Capillary | Carbowax 20M | 1107. | Cornwell and Cordano, 2003 | Program: not specified |

References

Browne and Rossini, 1960
Browne, C.C.; Rossini, F.D.,
Heats of combustion, formation, and isomerization of the cis and trans isomers of hexahydroindan,
J. Phys. Chem., 1960, 64, 927-931. [all data]
Chang S., 1970
Chang S.,
The heats of combustion and strain energies of bicyclo[n.m.0]alkanes,
J. Am. Chem. Soc., 1970, 92, 3109-3118. [all data]
Huckel, Kamenz, et al., 1937
Huckel, W.; Kamenz, E.; Gross, A.; Tappe, W.,
Zur kenntnis der waldenschen umkehrung,
Ann. Chim., 1937, 533, 1-45. [all data]
Cox and Pilcher, 1970
Cox, J.D.; Pilcher, G.,
Thermochemistry of Organic and Organometallic Compounds, Academic Press, New York, 1970, 1-636. [all data]
Finke, McCullough, et al., 1972
Finke, H.L.; McCullough, J.P.; Messerly, J.F.; Osborn, A.; Douslin, D.R.,
cis- and trans-Hexahydroindan. Chemical thermodynamic properties and isomerization equilibrium,
J. Chem. Thermodyn., 1972, 4, 477-494. [all data]
Finke, McCullough, et al., 1972, 2
Finke, H.L.; McCullough, J.P.; Messerly, J.F.; Osborn, A.G.; Douslin, D.R.,
cis- and trans-Hexahydroindan. Chemical thermodynamic properties and isomerization equilibrium,
J. Chem. Thermodyn., 1972, 4, 477-94. [all data]
Stephenson and Malanowski, 1987
Stephenson, Richard M.; Malanowski, Stanislaw,
Handbook of the Thermodynamics of Organic Compounds, 1987, https://doi.org/10.1007/978-94-009-3173-2
. [all data]
Camin and Rossini, 1955
Camin, David L.; Rossini, Frederick D.,
Physical Properties of Fourteen API Research Hydrocarbons, C 9 to C 15,
J. Phys. Chem., 1955, 59, 11, 1173-1179, https://doi.org/10.1021/j150533a014
. [all data]
Finke, McCullough, et al., 1972, 3
Finke, H.L.; McCullough, J.P.; Messerly, J.F.; Osborn, A.; Douslin, D.R.,
cis- and trans-Hexahydroindan. Chemical thermodynamic properties and isomerization equilibrium,
J. Chem. Thermodyn., 1972, 4, 3, 477, https://doi.org/10.1016/0021-9614(72)90032-8
. [all data]
Blanchard and Schleyer, 1963
Blanchard, K.R.; Schleyer, P.,
Quantitative study of the interconversion of hydrindane isomers by aluminum bromide,
J. Org. Chem., 1963, 28, 247-248. [all data]
Allinger and Coke, 1960
Allinger, N.L.; Coke, J.L.,
The relative stabilities of cis and trans isomers. VII. The hydrindanes,
J. Am. Chem. Soc., 1960, 82, 2553-2556. [all data]
Dolliver, Gresham, et al., 1937
Dolliver, M.a.; Gresham, T.L.; Kistiakowsky, G.B.; Vaughan, W.E.,
Heats of organic reactions. V. Heats of hydrogenation of various hydrocarbons,
J. Am. Chem. Soc., 1937, 59, 831-841. [all data]
Frye and Weitkamp, 1969
Frye, C.G.; Weitkamp, A.W.,
Equilibrium hydrogenations of multi-ring aromatics,
J. Chem. Eng. Data, 1969, 14, 372-376. [all data]
Mikaya and Zaikin, 1980
Mikaya, A.I.; Zaikin, V.G.,
Determination of the difference in enthalpies of formation of the cis- and trans-isomers of bicyclo[4.3.0]nonane and bicyclo[4.4.0]decane using appearance potentials,
Izv. Akad. Nauk SSSR, Ser. Khim., 1980, 6, 1286. [all data]
Natalis, 1963
Natalis, P.,
Etude du comportement d'isomeres geometriques sous l'impact electronique. II. Les cis et trans hexahydroindanes,
Bull. Soc. Chim. Belges, 1963, 72, 374. [all data]
Dallos, Sisak, et al., 2000
Dallos, A.; Sisak, A.; Kulcsár, Z.; Kováts, E.,
Pair-wise interactions by gas chromatography VII. Interaction free enthalpies of solutes with secondary alcohol groups,
J. Chromatogr. A, 2000, 904, 2, 211-242, https://doi.org/10.1016/S0021-9673(00)00908-0
. [all data]
Kowalski, 1992
Kowalski, W.J.,
Free radical crosslinking of the gas chromatographic stationary phase containing europium chelates,
Chromatographia, 1992, 34, 5-8, 266-268, https://doi.org/10.1007/BF02268356
. [all data]
Reddy, Dutoit, et al., 1992
Reddy, K.S.; Dutoit, J.-Cl.; Kovats, E. sz.,
Pair-wise interactions by gas chromatography. I. Interaction free enthalpies of solutes with non-associated primary alcohol groups,
J. Chromatogr., 1992, 609, 1-2, 229-259, https://doi.org/10.1016/0021-9673(92)80167-S
. [all data]
Maeck, Touabet, et al., 1989
Maeck, M.; Touabet, A.; Badjah Hadj Ahmed, A.Y.; Meklati, B.Y.,
A numerical interpolation of Kováts indices without dead time correction,
Chromatographia, 1989, 27, 5/6, 205-208, https://doi.org/10.1007/BF02260447
. [all data]
Fernández-Sánchez, Fernández-Torres, et al., 1987
Fernández-Sánchez, E.; Fernández-Torres, A.; García-Domínguez, J.A.; García-Muñoz, J.; Menéndez, V.; Molera, M.J.; Santiuste, J.M.; Pertierra-Rimada, E.,
Mixed stationary phases in gas-liquid chromatography. Partition coefficients and retention indices in OV-101-OV-25, OV-101-Carbowax 20M and OV-225-SP-2340 mixtures,
J. Chromatogr., 1987, 410, 13-29, https://doi.org/10.1016/S0021-9673(00)90031-1
. [all data]
Kersten and Poole, 1987
Kersten, B.R.; Poole, C.F.,
Influence of concurrent retention mechanisms on the determination of stationary phase selectivity in gas chromatography,
J. Chromatogr., 1987, 399, 1-31, https://doi.org/10.1016/S0021-9673(00)96108-9
. [all data]
Tóth, 1983
Tóth, T.,
Use of capillary gas chromatography in collecting retention and chemical information for the analysis of complex petrochemical mixtures,
J. Chromatogr., 1983, 279, 157-165, https://doi.org/10.1016/S0021-9673(01)93614-3
. [all data]
Bredael, 1982
Bredael, P.,
Retention indices of hydrocarbons on SE-30,
J. Hi. Res. Chromatogr. Chromatogr. Comm., 1982, 5, 6, 325-328, https://doi.org/10.1002/jhrc.1240050610
. [all data]
Engewald, Epsch, et al., 1976
Engewald, W.; Epsch, K.; Welsch, Th.; Graefe, J.,
Molekülstruktur und Retentionsverhalten. VI. Retentionsverhalten von bicycle[n.m.0]alkanen bei der gas-adsorptions- und gas-verteilungs-chromatographie,
J. Chromatogr., 1976, 119, 119-128, https://doi.org/10.1016/S0021-9673(00)86776-X
. [all data]
Song, Lai, et al., 2003
Song, C.; Lai, W.-C.; Madhusudan Reddy, K.; Wei, B.,
Chapter 7. Temperature-programmed retention indices for GC and GC-MS of hydrocarbon fuels and simulated distillation GC of heavy oils
in Analytical advances for hydrocarbon research, Hsu,C.S., ed(s)., Kluwer Academic/Plenum Publishers, New York, 2003, 147-193. [all data]
Lai and Song, 1995
Lai, W.-C.; Song, C.,
Temperature-programmed retention indices for g.c. and g.c.-m.s. analysis of coal- and petroleum-derived liquid fuels,
Fuel, 1995, 74, 10, 1436-1451, https://doi.org/10.1016/0016-2361(95)00108-H
. [all data]
White, Hackett, et al., 1992
White, C.M.; Hackett, J.; Anderson, R.R.; Kail, S.; Spock, P.S.,
Linear temperature programmed retention indices of gasoline range hydrocarbons and chlorinated hydrocarbons on cross-linked polydimethylsiloxane,
J. Hi. Res. Chromatogr., 1992, 15, 2, 105-120, https://doi.org/10.1002/jhrc.1240150211
. [all data]
Tello, Lebron-Aguilar, et al., 2009
Tello, A.M.; Lebron-Aguilar, R.; Quintanilla-Lopez, J.E.; Santiuste, J.M.,
Isothermal retention indices on poly93-cyanopropylmethyl)siloxane stationary phases,
J. Chromatogr. A, 2009, 1216, 10, 1630-1639, https://doi.org/10.1016/j.chroma.2008.10.025
. [all data]
Lebrón-Aguilar, Quintanilla-López, et al., 2007
Lebrón-Aguilar, R.; Quintanilla-López, J.E.; Tello, A.M.; Santiuste, J.M.,
Isothermal retention indices on poly (3,3,3-trifluoropropylmethylsiloxane) stationary phases,
J. Chromatogr. A, 2007, 1160, 1-2, 276-288, https://doi.org/10.1016/j.chroma.2007.05.025
. [all data]
Ferrand, 1962
Ferrand, R.,
Gas phase chromatography using retention indices for the analysis of tars and their hydrogenation products,
Journees internationales d'etude des methodes de separation immediate at de chromatographie; Org. sur l'initiative du IX., 1962, 132-140. [all data]
Supelco, 2012
Supelco, CatalogNo. 24160-U,
Petrocol DH Columns. Catalog No. 24160-U, 2012, retrieved from http://www.sigmaaldrich.com/etc/medialib/docs/Supelco/Datasheet/1/w97949.Par.0001.File.tmp/w97949.pdf. [all data]
Cornwell and Cordano, 2003
Cornwell, E.; Cordano, G.,
Nueva proposicion para predecir datos de retencion obtenidos mediante cromatografia de gases de hidrocarburos derivados de las naftas,
Revista de la Sociedad Quimica de Mexico, 2003, 47, 1, 38-43. [all data]
Waggott and Davies, 1984
Waggott, A.; Davies, I.W.,
Identification of organic pollutants using linear temperature programmed retention indices (LTPRIs) - Part II, 1984, retrieved from http://dwi.defra.gov.uk/research/completed-research/reports/dwi0383.pdf. [all data]