Borane, dimethoxy-
- Formula: C2H7BO2
- Molecular weight: 73.887
- IUPAC Standard InChIKey: VAWRKITUPUFMHV-UHFFFAOYSA-N
- CAS Registry Number: 4542-61-4
- Chemical structure:
View 3d structure (requires JavaScript / HTML 5) - Other names: Dimethoxyborane; (CH3O)2BH

Gas phase ion energetics data

Data compiled as indicated in comments:
RDSH - Henry M. Rosenstock, Keith Draxl, Bruce W. Steiner, and John T. Herron
Ionization energy determinations
IE (eV) | Method | Reference | Comment |
---|---|---|---|
9.7 ± 1.0 | EI | Law and Margrave, 1956 | RDSH |
Appearance energy determinations
Ion | AE (eV) | Other Products | Method | Reference | Comment |
---|---|---|---|---|---|
B+ | 23.4 ± 0.5 | ? | EI | Law and Margrave, 1956 | RDSH |
BH+ | 28.3 ± 2.0 | ? | EI | Law and Margrave, 1956 | RDSH |
CH3+ | 13.4 ± 0.5 | ? | EI | Law and Margrave, 1956 | RDSH |
C2H6BO2+ | 9.0 ± 0.2 | H | EI | Law and Margrave, 1956 | RDSH |

References

Law and Margrave, 1956
Law, R.W.; Margrave, J.L.,
Mass spectrometer appearance potentials for positive ion fragments from BF3, B(CH3)3, B(C2H5)3, B(OCH3)3, and HB(OCH3)2,
J. Chem. Phys., 1956, 25, 1086. [all data]