1-bromo-3-chloropropan-2-ol
- Formula: C3H6BrClO
- Molecular weight: 173.436
- IUPAC Standard InChIKey: XKRACSSCBRXMFN-UHFFFAOYSA-N
- CAS Registry Number: 4540-44-7
- Chemical structure:
View 3d structure (requires JavaScript / HTML 5) - Other names: 1-Propanol, 1-bromo-3-chloro-

Phase change data

Data compiled by: Robert L. Brown and Stephen E. Stein
Reduced pressure boiling point
Tboil (K) | Pressure (bar) | Reference |
---|---|---|
361. | 0.020 | Buckingham and Donaghy, 1982 |

Gas phase ion energetics data

Data compiled by: Sharon G. Lias, John E. Bartmess, Joel F. Liebman, John L. Holmes, Rhoda D. Levin, and W. Gary Mallard
Ionization energy determinations
IE (eV) | Method | Reference |
---|---|---|
10.31 | PE | Koppel, Molder, et al., 1983 |

References

Buckingham and Donaghy, 1982
Buckingham, J.; Donaghy, S.M.,
Dictionary of Organic Compounds: Fifth Edition, Chapman and Hall, New York, 1982, 1. [all data]
Koppel, Molder, et al., 1983
Koppel, I.A.; Molder, U.H.; Pikver, R.J.,
Photoelectron spectra of molecules. I. Alcohols,
Org. React. Tartu, 1983, 20, 45. [all data]