3-Furanol, tetrahydro-
- Formula: C4H8O2
- Molecular weight: 88.1051
- IUPAC Standard InChIKey: XDPCNPCKDGQBAN-UHFFFAOYSA-N
- CAS Registry Number: 453-20-3
- Chemical structure:
View 3d structure (requires JavaScript / HTML 5) - Other names: 3-Hydroxytetrahydrofuran; Tetrahydro-3-furanol; Tetrahydrofuran, 3-hydroxy-; tetrahydrofuran-3-ol

Gas phase ion energetics data

Data compiled by: Sharon G. Lias and Joel F. Liebman
Ionization energy determinations
IE (eV) | Method | Reference | Comment |
---|---|---|---|
9.77 | PE | Yu, Kim, et al., 1992 | Vertical value |

Normal alkane RI, polar column, custom temperature program

View large format table.

Column type Active phase I Reference Comment
CapillaryBP-201619.Rodrigues, Caldera, et al., 200830. m/0.25 mm/0.25 μm, Helium; Program: 40 0C (1 min) 2 0C/min -> 100 0C (2 min) 1.7 0C/min -> 180 0C (1 min) 25 0C/min -> 220 0C (10 min)

References

Yu, Kim, et al., 1992
Yu, M.; Kim, H.S.; LeBreton, P.R.,
UV photoelectron and theoretical characterization of 2'-deoxyguanosine-5'-phosphate valence electronic propeprties: Changes in structure associated with the B to Z-DNA conformational transition,
Biochem. Biophys. Res. Commun., 1992, 184, 16. [all data]