Methyl fluoroacetate
- Formula: C3H5FO2
- Molecular weight: 92.0690
- IUPAC Standard InChIKey: RJBYSQHLLIHSLT-UHFFFAOYSA-N
- CAS Registry Number: 453-18-9
- Chemical structure:
View 3d structure (requires JavaScript / HTML 5) - Other names: Fluoracetic acid methyl ester; Acetic acid, fluoro-, methyl ester; Fluoroacetic acid, methyl ester; Methylester kyseliny fluoroctove; MFA; TL 551

Phase change data

Data compiled as indicated in comments:
BS - Robert L. Brown and Stephen E. Stein
AC - William E. Acree, Jr., James S. Chickos
Quantity | Value | Units | Method | Reference | Comment |
---|---|---|---|---|---|
Tboil | 377.7 | K | N/A | Weast and Grasselli, 1989 | BS |
Enthalpy of vaporization
ΔvapH (kJ/mol) | Temperature (K) | Method | Reference | Comment |
---|---|---|---|---|
42.7 | 288. | A,GS | Stephenson and Malanowski, 1987 | Based on data from 273. to 333. K. See also Redemann, Chaikin, et al., 1948 and Dykyj, 1970.; AC |

Gas phase ion energetics data

Data compiled by: Sharon G. Lias, John E. Bartmess, Joel F. Liebman, John L. Holmes, Rhoda D. Levin, and W. Gary Mallard
Appearance energy determinations
Ion | AE (eV) | Other Products | Method | Reference | Comment |
---|---|---|---|---|---|
C2H5F+ | 10.90 | CO2 | EI | Blanchette, Holmes, et al., 1987 |

References

Weast and Grasselli, 1989
CRC Handbook of Data on Organic Compounds, 2nd Editon, Weast,R.C and Grasselli, J.G., ed(s)., CRC Press, Inc., Boca Raton, FL, 1989, 1. [all data]
Stephenson and Malanowski, 1987
Stephenson, Richard M.; Malanowski, Stanislaw,
Handbook of the Thermodynamics of Organic Compounds, 1987, https://doi.org/10.1007/978-94-009-3173-2
. [all data]
Redemann, Chaikin, et al., 1948
Redemann, C. Ernst; Chaikin, Saul W.; Fearing, Ralph B.; Rotariu, George J.; Savit, Joseph; Hoesen, Drusilla van,
The Vapor Pressures of Forty-one Fluorine-containing Organic Compounds 1,
J. Am. Chem. Soc., 1948, 70, 11, 3604-3606, https://doi.org/10.1021/ja01191a017
. [all data]
Dykyj, 1970
Dykyj, J.,
Petrochemica, 1970, 10, 2, 51. [all data]
Blanchette, Holmes, et al., 1987
Blanchette, M.C.; Holmes, J.L.; Lossing, F.P.,
The ethyl halides: Stable neutral and radical cation isomers [C2, H5, X] where X = F, Cl, Br, I,
Org. Mass Spectrom., 1987, 22, 701. [all data]