2-Propanone, 1,3-difluoro-
- Formula: C3H4F2O
- Molecular weight: 94.0601
- IUPAC Standard InChIKey: HKIPCXRNASWFRU-UHFFFAOYSA-N
- CAS Registry Number: 453-14-5
- Chemical structure:
View 3d structure (requires JavaScript / HTML 5) - Other names: (CH2F)2CO; 1,3-Difluoroacetone; sym-Difluoroacetone; 1,3-Difluoro-2-propanone; 1,3-Difluoropropan-2-one; CFH2COCFH2

Reaction thermochemistry data

Data compiled by: John E. Bartmess
Individual Reactions
C3H3F2O- + =
By formula: C3H3F2O- + H+ = C3H4F2O
Quantity | Value | Units | Method | Reference | Comment |
---|---|---|---|---|---|
ΔrH° | 1466. ± 13. | kJ/mol | G+TS | Farid and McMahon, 1980 | gas phase; Between PhCH2CN, CF3COCH3; value altered from reference due to change in acidity scale |
Quantity | Value | Units | Method | Reference | Comment |
ΔrG° | 1436. ± 13. | kJ/mol | IMRB | Farid and McMahon, 1980 | gas phase; Between PhCH2CN, CF3COCH3; value altered from reference due to change in acidity scale |
(CAS Reg. No. 1064658-34-9 • 4294967295) +
= CAS Reg. No. 1064658-34-9
By formula: (CAS Reg. No. 1064658-34-9 • 4294967295C3H4F2O) + C3H4F2O = CAS Reg. No. 1064658-34-9
Quantity | Value | Units | Method | Reference | Comment |
---|---|---|---|---|---|
ΔrH° | 213. ± 27. | kJ/mol | Ther | Clair and McMahon, 1980 | gas phase; Between MeCHO, PhCOMe; value altered from reference due to change in acidity scale |

Gas phase ion energetics data

Data evaluated as indicated in comments:
HL - Edward P. Hunter and Sharon G. Lias
Data compiled as indicated in comments:
B - John E. Bartmess
Quantity | Value | Units | Method | Reference | Comment |
---|---|---|---|---|---|
Proton affinity (review) | 762.8 | kJ/mol | N/A | Hunter and Lias, 1998 | HL |
Quantity | Value | Units | Method | Reference | Comment |
Gas basicity | 733.0 | kJ/mol | N/A | Hunter and Lias, 1998 | HL |
De-protonation reactions
C3H3F2O- + =
By formula: C3H3F2O- + H+ = C3H4F2O
Quantity | Value | Units | Method | Reference | Comment |
---|---|---|---|---|---|
ΔrH° | 1466. ± 13. | kJ/mol | G+TS | Farid and McMahon, 1980 | gas phase; Between PhCH2CN, CF3COCH3; value altered from reference due to change in acidity scale; B |
Quantity | Value | Units | Method | Reference | Comment |
ΔrG° | 1436. ± 13. | kJ/mol | IMRB | Farid and McMahon, 1980 | gas phase; Between PhCH2CN, CF3COCH3; value altered from reference due to change in acidity scale; B |

References

Farid and McMahon, 1980
Farid, R.; McMahon, T.B.,
The gas phase acidities of fluorinated acetones. An ICR investigation of the role of fluorine substituents in the stabilization of planar carbanions,
Can. J. Chem., 1980, 58, 2307. [all data]
Clair and McMahon, 1980
Clair, R.L.; McMahon, T.B.,
An ion cyclotron resonance study of base-induced elimination reactions of fluorinated alcohols and unimolecular loss of HF from chemically activated fluoroalkoxide ions,
Int. J. Mass Spectrom. Ion Phys., 1980, 33, 21. [all data]
Hunter and Lias, 1998
Hunter, E.P.; Lias, S.G.,
Evaluated Gas Phase Basicities and Proton Affinities of Molecules: An Update,
J. Phys. Chem. Ref. Data, 1998, 27, 3, 413-656, https://doi.org/10.1063/1.556018
. [all data]