2-Cyclohexen-1-one, 4,4-diphenyl-
- Formula: C18H16O
- Molecular weight: 248.3190
- IUPAC Standard InChIKey: LUFGFXHHSGISSL-UHFFFAOYSA-N
- CAS Registry Number: 4528-64-7
- Chemical structure:
View 3d structure (requires JavaScript / HTML 5) - Other names: 4,4-Diphenyl-2-cyclohexen-1-one

Gas phase ion energetics data

Data compiled by: Sharon G. Lias, Rhoda D. Levin, and Sherif A. Kafafi
Appearance energy determinations
Ion | AE (eV) | Other Products | Method | Reference | Comment |
---|---|---|---|---|---|
C13H9+ | 14.4 ± 0.4 | ? | EI | Fortin and Rousseau, 1973 | |
C16H14+ | 9.3 ± 0.4 | ? | EI | Fortin and Rousseau, 1973 |

References

Fortin and Rousseau, 1973
Fortin, C.J.; Rousseau, Y.,
Spectrometrie de masse des cyclohexanones gem-diphenylees. II. Chaleurs de formation et structures possibles des principaux ions fragmentaires,
Can. J. Chem., 1973, 51, 3457. [all data]