1,4-Bis(trimethylsilyl)-1,3-butadiyne
- Formula: C10H18Si2
- Molecular weight: 194.4209
- IUPAC Standard InChIKey: LBNVCJHJRYJVPK-UHFFFAOYSA-N
- CAS Registry Number: 4526-07-2
- Chemical structure:
View 3d structure (requires JavaScript / HTML 5) - Other names: 1,4-Bis(trimethylsilyl)butadiyne

Gas phase ion energetics data

Data compiled as indicated in comments:
LLK - Sharon G. Lias, Rhoda D. Levin, and Sherif A. Kafafi
RDSH - Henry M. Rosenstock, Keith Draxl, Bruce W. Steiner, and John T. Herron
Ionization energy determinations
IE (eV) | Method | Reference | Comment |
---|---|---|---|
9.23 ± 0.04 | EI | Bock and Seidl, 1968 | RDSH |
8.85 | PE | Kaim and Bock, 1979 | Vertical value; LLK |

References

Bock and Seidl, 1968
Bock, H.; Seidl, H.,
d-Orbital effects in siliconsubstituted π-electron systems. Part XII. Some spectroscopic properties of alkyl and silyl acetylenes and polyacetylenes,
J. Chem. Soc. B, 1968, 1158. [all data]
Kaim and Bock, 1979
Kaim, W.; Bock, H.,
Radical ions XVII. Radical ions of tetrakis(trimethylsilyl)butatriene,
J. Organomet. Chem., 1979, 164, 281. [all data]