Acetic acid, 2-chlorophenyl ester
- Formula: C8H7ClO2
- Molecular weight: 170.593
- IUPAC Standard InChIKey: CJPVPOYTTALCNX-UHFFFAOYSA-N
- CAS Registry Number: 4525-75-1
- Chemical structure:
View 3d structure (requires JavaScript / HTML 5) - Other names: o-Acetoxychlorobenzene; o-Chlorophenyl acetate; Acetic acid, o-chlorophenyl ester; Phenol, o-chloro-, acetate; o-Chlorfenylester kyseliny octove; 2-Chlorophenyl acetate; o-Chlorfenylester kyseliny octove (czech)

Gas phase ion energetics data

Data compiled by: Sharon G. Lias, Rhoda D. Levin, and Sherif A. Kafafi
Ionization energy determinations
IE (eV) | Method | Reference |
---|---|---|
8.67 ± 0.03 | EI | Benezra and Bursey, 1971 |
Appearance energy determinations
Ion | AE (eV) | Other Products | Method | Reference | Comment |
---|---|---|---|---|---|
C2H3O+ | 12.55 ± 0.03 | ? | EI | Benezra and Bursey, 1971 | |
C6H5OCl+ | 9.19 ± 0.03 | CH2=C=O | EI | Benezra and Bursey, 1971 |

Kovats' RI, non-polar column, isothermal

Column type | Active phase | Temperature (C) | I | Reference | Comment |
---|---|---|---|---|---|
Capillary | SE-30 | 160. | 1173. | Evans and Haken, 1989 | Column length: 25. m; Column diameter: 0.32 mm |
Capillary | SE-30 | 180. | 1192. | Tarjan, Nyiredy, et al., 1989 | |
Capillary | OV-101 | 160. | 1173. | Haken and Korhonen, 1983 | N2; Column length: 25. m; Column diameter: 0.22 mm |
Capillary | OV-101 | 180. | 1192. | Haken and Korhonen, 1983 | N2; Column length: 25. m; Column diameter: 0.22 mm |
Capillary | OV-101 | 200. | 1199. | Haken and Korhonen, 1983 | N2; Column length: 25. m; Column diameter: 0.22 mm |

Kovats' RI, polar column, isothermal

Column type | Active phase | Temperature (C) | I | Reference | Comment |
---|---|---|---|---|---|
Capillary | OV-351 | 160. | 1829. | Evans and Haken, 1989 | Column length: 25. m; Column diameter: 0.32 mm |

Van Den Dool and Kratz RI, non-polar column, temperature ramp

Column type | Active phase | I | Reference | Comment |
---|---|---|---|---|
Capillary | ZB-1 | 1172. | Urbanczyk, Staniewski, et al., 2002 | 30. m/0.25 mm/0.50 μm, He, 50. C @ 3. min, 10. K/min, 280. C @ 10. min |

References

Benezra and Bursey, 1971
Benezra, S.A.; Bursey, M.M.,
ortho-Effects on ordering factors in mass spectral rearrangements. Loss of keten from halogenated phenyl acetates and acetanilides,
J. Chem. Soc. B, 1971, 1515. [all data]
Evans and Haken, 1989
Evans, M.B.; Haken, J.K.,
Dispersion and selectivity indices in gas chromatography. IV. Chlorinated aromatic compounds,
J. Chromatogr., 1989, 468, 373-382, https://doi.org/10.1016/S0021-9673(00)96332-5
. [all data]
Tarjan, Nyiredy, et al., 1989
Tarjan, G.; Nyiredy, Sz.; Gyor, M.; Lombosi, E.R.; Lombosi, T.S.; Budahegyi, M.V.; Meszaros, S.Y.; Takacs, J.M.,
Review. Thirtieth Anniversary of the Retention Index According to Kovats in Gas-Liquid Chromatography,
J. Chromatogr., 1989, 472, 1-92, https://doi.org/10.1016/S0021-9673(00)94099-8
. [all data]
Haken and Korhonen, 1983
Haken, J.K.; Korhonen, I.O.O.,
Gas chromatography of homologous esters. XXI. Capillary column studies of the chlorinated phenyl acetates,
J. Chromatogr., 1983, 257, 267-273, https://doi.org/10.1016/S0021-9673(01)88182-6
. [all data]
Urbanczyk, Staniewski, et al., 2002
Urbanczyk, A.; Staniewski, J.; Szymanowski, J.,
Abraham model in gas chromatography of phenol pollutants,
Anal. Chim. Acta., 2002, 466, 1, 151-159, https://doi.org/10.1016/S0003-2670(02)00544-5
. [all data]