Benzoic acid, 3-amino-, methyl ester
- Formula: C8NO2
- Molecular weight: 142.0911
- IUPAC Standard InChIKey: VZDNXXPBYLGWOS-UHFFFAOYSA-N
- CAS Registry Number: 4518-10-9
- Chemical structure:
View 3d structure (requires JavaScript / HTML 5) - Other names: m-Aminobenzoic acid, methyl ester; Methyl-3-aminobenzoate; Methyl-m-aminobenzoate

Reaction thermochemistry data

Data compiled by: John E. Bartmess
Individual Reactions
C8H8NO2- + =
By formula: C8H8NO2- + H+ = C8NO2
Quantity | Value | Units | Method | Reference | Comment |
---|---|---|---|---|---|
ΔrH° | 1509. ± 8.8 | kJ/mol | G+TS | Taft and Topsom, 1987 | gas phase |
Quantity | Value | Units | Method | Reference | Comment |
ΔrG° | 1478. ± 8.4 | kJ/mol | IMRE | Taft and Topsom, 1987 | gas phase |

Gas phase ion energetics data

Data compiled by: John E. Bartmess
De-protonation reactions
C8H8NO2- + =
By formula: C8H8NO2- + H+ = C8NO2
Quantity | Value | Units | Method | Reference | Comment |
---|---|---|---|---|---|
ΔrH° | 1509. ± 8.8 | kJ/mol | G+TS | Taft and Topsom, 1987 | gas phase |
Quantity | Value | Units | Method | Reference | Comment |
ΔrG° | 1478. ± 8.4 | kJ/mol | IMRE | Taft and Topsom, 1987 | gas phase |

Van Den Dool and Kratz RI, non-polar column, temperature ramp

Column type | Active phase | I | Reference | Comment |
---|---|---|---|---|
Capillary | VF-5MS | 1475. | Todua, 2011 | 30. m/0.25 mm/0.25 μm, He; Tstart: 60. C; Tend: 270. C |

References

Taft and Topsom, 1987
Taft, R.W.; Topsom, R.D.,
The Nature and Analysis of Substituent Effects,
Prog. Phys. Org. Chem., 1987, 16, 1. [all data]
Todua, 2011
Todua, N.G.,
Retention Data. NIST Mass Spectrometry Data Center., NIST Mass Spectrometry Data Center, 2011. [all data]