Pyrrole-2-carbonitrile
- Formula: C5H4N2
- Molecular weight: 92.0987
- IUPAC Standard InChIKey: BQMPGKPTOHKYHS-UHFFFAOYSA-N
- CAS Registry Number: 4513-94-4
- Chemical structure:
View 3d structure (requires JavaScript / HTML 5) - Permanent link for this species. Use this link for bookmarking this species for future reference.

Gas phase ion energetics data

Data compiled by: Sharon G. Lias, John E. Bartmess, Joel F. Liebman, John L. Holmes, Rhoda D. Levin, and W. Gary Mallard
Ionization energy determinations
IE (eV) | Method | Reference | Comment |
---|---|---|---|
8.7 | PE | Guimon, Khayar, et al., 1982 | |
9.08 | PE | Guimon, Khayar, et al., 1982 | Vertical value |

References

Guimon, Khayar, et al., 1982
Guimon, C.; Khayar, S.; Pfister-Guillouzo, G.; Claramunt, R.M.; Elguero, J.,
A direct photoelectron spectroscopy study of the 1-azidopyridine pyrolysis,
Spectrosc. Lett., 1982, 15, 435. [all data]