Dibenz[b,e]oxepin-11(6H)-one
- Formula: C14H10O2
- Molecular weight: 210.2280
- IUPAC Standard InChIKey: YUSHFLBKQQILNV-UHFFFAOYSA-N
- CAS Registry Number: 4504-87-4
- Chemical structure:
View 3d structure (requires JavaScript / HTML 5) - Other names: 6,11-Dihydrodibenz[b,e]oxepin-11-one; 6,11-Dihydrobenz[b,e]oxepin-11-one

Gas phase ion energetics data

Data compiled by: Sharon G. Lias, Rhoda D. Levin, and Sherif A. Kafafi
Ionization energy determinations
IE (eV) | Method | Reference |
---|---|---|
9.63 | EI | Sahini, Constantin, et al., 1978 |
Appearance energy determinations
Ion | AE (eV) | Other Products | Method | Reference | Comment |
---|---|---|---|---|---|
C13H10O+ | 11.5 | CO | EI | Sahini, Constantin, et al., 1978 | |
C14H9O2+ | 10.8 | H | EI | Sahini, Constantin, et al., 1978 |

References

Sahini, Constantin, et al., 1978
Sahini, V.E.; Constantin, V.; Serban, I.; Vladescu, C.,
Electron impact-induced fragmentation of dibenzo[b,e]oxepin-11-one and dibenzo/b,e/thiepin-11-one,
Rev. Roum. Chim., 1978, 23, 163. [all data]