1,1':4',1'':4'',1''':4''',1'''':4'''',1'''''-Sexiphenyl
- Formula: C36H26
- Molecular weight: 458.5916
- IUPAC Standard InChIKey: ZEMDSNVUUOCIED-UHFFFAOYSA-N
- CAS Registry Number: 4499-83-6
- Chemical structure:
View 3d structure (requires JavaScript / HTML 5) - Other names: p-Quaterphenyl, 4,4'''-diphenyl-; p-Sexiphenyl; 1,1':4',1'':4'',1'''-Quaterphenyl, 4,4'''-diphenyl-; p-Hexaphenyl; p-Sexiphenylene

Gas phase ion energetics data

Data compiled by: Henry M. Rosenstock, Keith Draxl, Bruce W. Steiner, and John T. Herron
Ionization energy determinations
IE (eV) | Method | Reference |
---|---|---|
7.67 ± 0.05 | EI | Gallegos, 1967 |
Appearance energy determinations
Ion | AE (eV) | Other Products | Method | Reference | Comment |
---|---|---|---|---|---|
C18H12+ | 18.5 ± 0.3 | ? | EI | Gallegos, 1967 | |
C18H13+ | 19.5 ± 0.3 | ? | EI | Gallegos, 1967 | |
C36H22+ | 15.6 ± 0.2 | 2H2 | EI | Gallegos, 1967 |

References

Gallegos, 1967
Gallegos, E.J.,
Mass spectrometry of some polyphenyls,
J. Phys. Chem., 1967, 71, 1647. [all data]