Naphthalene, 1,2-dihydro-
- Formula: C10H10
- Molecular weight: 130.1864
- IUPAC Standard InChIKey: KEIFWROAQVVDBN-UHFFFAOYSA-N
- CAS Registry Number: 447-53-0
- Chemical structure:
View 3d structure (requires JavaScript / HTML 5) - Other names: Dialin; δ1-Dialin; 1,2-Dialin; 1,2-Dihydronaphthalene; Diolin

Gas phase thermochemistry data

Data compiled by: Glushko Thermocenter, Russian Academy of Sciences, Moscow
Constant pressure heat capacity of gas
Cp,gas (J/mol*K) | Temperature (K) | Reference | Comment |
---|---|---|---|
38.10 | 50. | Dorofeeva O.V., 1988 | Recommended values were calculated statistically mechanically using force field approximation for polycyclic aromatic hydrocarbons to estimate the needed vibrational frequencies (see also [ Dorofeeva O.V., 1986]). These functions are reproduced in the reference book [ Frenkel M., 1994]. |
52.16 | 100. | ||
70.54 | 150. | ||
92.66 | 200. | ||
129.53 | 273.15 | ||
142.7 ± 2.0 | 298.15 | ||
143.63 | 300. | ||
194.26 | 400. | ||
237.71 | 500. | ||
273.14 | 600. | ||
301.96 | 700. | ||
325.66 | 800. | ||
345.40 | 900. | ||
362.00 | 1000. | ||
376.05 | 1100. | ||
388.01 | 1200. | ||
398.23 | 1300. | ||
407.02 | 1400. | ||
414.60 | 1500. |

Phase change data

Data compiled as indicated in comments:
BS - Robert L. Brown and Stephen E. Stein
AC - William E. Acree, Jr., James S. Chickos
Quantity | Value | Units | Method | Reference | Comment |
---|---|---|---|---|---|
ΔvapH° | 54.8 ± 0.1 | kJ/mol | IP,EB | Chirico and Steele, 2008 | AC |
ΔvapH° | 51.9 ± 0.4 | kJ/mol | GS | Verevkin, 1999 | Based on data from 274. to 319. K.; AC |
Reduced pressure boiling point
Tboil (K) | Pressure (bar) | Reference | Comment |
---|---|---|---|
362.2 | 0.021 | Aldrich Chemical Company Inc., 1990 | BS |
Enthalpy of vaporization
ΔvapH (kJ/mol) | Temperature (K) | Method | Reference | Comment |
---|---|---|---|---|
53.4 ± 0.1 | 320. | IP,EB | Chirico and Steele, 2008 | AC |
50.8 ± 0.1 | 360. | IP,EB | Chirico and Steele, 2008 | AC |
48.4 ± 0.1 | 400. | IP,EB | Chirico and Steele, 2008 | AC |
45.9 ± 0.1 | 440. | IP,EB | Chirico and Steele, 2008 | AC |
51.9 ± 0.4 | 296. | GS | Verevkin, 1999 | Based on data from 274. to 319. K.; AC |
Enthalpy of fusion
ΔfusH (kJ/mol) | Temperature (K) | Method | Reference | Comment |
---|---|---|---|---|
10.53 | 264.4 | AC | Chirico and Steele, 2008 | Authors report two solid/solid phase transitions having negligible enthalpy of transition; AC |

Reaction thermochemistry data

Data compiled by: Hussein Y. Afeefy, Joel F. Liebman, and Stephen E. Stein
Individual Reactions
By formula: H2 + C10H10 = C10H12
Quantity | Value | Units | Method | Reference | Comment |
---|---|---|---|---|---|
ΔrH° | -100.83 ± 0.83 | kJ/mol | Chyd | Williams, 1942 | liquid phase; solvent: Acetic acid; At 302 K |

Gas phase ion energetics data

Data compiled as indicated in comments:
LBLHLM - Sharon G. Lias, John E. Bartmess, Joel F. Liebman, John L. Holmes, Rhoda D. Levin, and W. Gary Mallard
LLK - Sharon G. Lias, Rhoda D. Levin, and Sherif A. Kafafi
Ionization energy determinations
IE (eV) | Method | Reference | Comment |
---|---|---|---|
8.14 | EI | Dass and Gross, 1983 | LBLHLM |
8.0 | EI | Koppel, Schwarz, et al., 1974 | LLK |

Kovats' RI, non-polar column, isothermal

Column type | Active phase | Temperature (C) | I | Reference | Comment |
---|---|---|---|---|---|
Capillary | SE-30 | 130. | 1165. | Bredael, 1982 | Column length: 100. m; Column diameter: 0.5 mm |
Capillary | SE-30 | 80. | 1137. | Bredael, 1982 | Column length: 100. m; Column diameter: 0.5 mm |
Capillary | Squalane | 86. | 1127.9 | Macák, Nabivach, et al., 1982 | N2; Column length: 50. m; Column diameter: 0.25 mm |
Capillary | Squalane | 96. | 1133.2 | Macák, Nabivach, et al., 1982 | N2; Column length: 50. m; Column diameter: 0.25 mm |
Capillary | OV-101 | 140. | 1171.4 | Gerasimenko, Kirilenko, et al., 1981 | N2; Column length: 50. m; Column diameter: 0.3 mm |
Capillary | OV-101 | 160. | 1183.2 | Gerasimenko, Kirilenko, et al., 1981 | N2; Column length: 50. m; Column diameter: 0.3 mm |
Capillary | Squalane | 120. | 1148. | Bogoslovsky, Anvaer, et al., 1978 | |
Capillary | Squalane | 86. | 1127.9 | Nabivach, Bur'yan, et al., 1978 | Column length: 50. m; Column diameter: 0.25 mm |
Capillary | Squalane | 96. | 1133.2 | Nabivach, Bur'yan, et al., 1978 | Column length: 50. m; Column diameter: 0.25 mm |
Capillary | SE-30 | 65. | 1114.4 | Svob, Deur-Siftar, et al., 1974 | He; Column length: 25.5 m; Column diameter: 0.5 mm |
Capillary | SE-30 | 65. | 1115.0 | Svob, Deur-Siftar, et al., 1974 | He; Column length: 25.5 m; Column diameter: 0.5 mm |
Capillary | Squalane | 120. | 1148. | Schomburg, 1966 |

Van Den Dool and Kratz RI, non-polar column, temperature ramp

Column type | Active phase | I | Reference | Comment |
---|---|---|---|---|
Capillary | Petrocol DH | 1141. | White, Hackett, et al., 1992 | 100. m/0.25 mm/0.5 μm, He, 1. K/min; Tstart: 30. C; Tend: 220. C |
Capillary | DB-5 | 1166. | Rostad and Pereira, 1986 | 30. m/0.26 mm/0.25 μm, He, 50. C @ 4. min, 6. K/min, 300. C @ 20. min |

Lee's RI, non-polar column, temperature ramp

Column type | Active phase | I | Reference | Comment |
---|---|---|---|---|
Capillary | HP-5 | 195.2 | Wang, Hou, et al., 2007 | 30. m/0.30 mm/0.25 μm, Helium, 50. C @ 5. min, 5. K/min, 200. C @ 15. min |
Capillary | HP-5 | 196.19 | Piao, Chu, et al., 1999 | 30. m/0.25 mm/0.25 μm, 50. C @ 2. min, 4. K/min, 280. C @ 20. min |
Capillary | DB-5 | 195.85 | Rostad and Pereira, 1986 | 30. m/0.26 mm/0.25 μm, He, 50. C @ 4. min, 6. K/min, 300. C @ 20. min |
Capillary | SE-52 | 197.01 | Lee, Vassilaros, et al., 1979 | 12. m/0.3 mm/0.34 μm, He, 2. K/min; Tstart: 50. C; Tend: 250. C |

Lee's RI, non-polar column, custom temperature program

Column type | Active phase | I | Reference | Comment |
---|---|---|---|---|
Capillary | DB-5 | 195.5 | Fuentes, Font, et al., 2007 | Column length: 60. m; Program: not specified |
Capillary | DB-5MS | 195.5 | Aracil, Font, et al., 2005 | Column length: 60. m; Column diameter: 0.25 mm; Program: not specified |
Capillary | HP-5MS | 209.43 | Cheng, Liu, et al., 2005 | 30. m/0.30 mm/0.25 μm, He; Program: 50 0C (2 min) 8 0C/min -> 120 0C (3 min) 10 0C/min -> 230 0C |

References

Dorofeeva O.V., 1988
Dorofeeva O.V.,
Thermodynamic Properties of Polycyclic Aromatic Hydrocarbons in the Gaseous Phase. Institute for High Temperatures, USSR Academy of Sciences, Preprint No.1-238 (in Russian), Moscow, 1988. [all data]
Dorofeeva O.V., 1986
Dorofeeva O.V.,
On calculation of thermodynamic properties of polycyclic aromatic hydrocarbons,
Thermochim. Acta, 1986, 102, 59-66. [all data]
Frenkel M., 1994
Frenkel M.,
Thermodynamics of Organic Compounds in the Gas State, Vol. I, II, Thermodynamics Research Center, College Station, Texas, 1994, 1994. [all data]
Chirico and Steele, 2008
Chirico, Robert D.; Steele, William V.,
Thermodynamic properties of 1,2-dihydronaphthalene: Glassy crystals and missing entropy,
The Journal of Chemical Thermodynamics, 2008, 40, 5, 806-817, https://doi.org/10.1016/j.jct.2008.01.009
. [all data]
Verevkin, 1999
Verevkin, Sergey P.,
Thermochemical investigation on α-methyl-styrene and parent phenyl substituted alkenes,
Thermochimica Acta, 1999, 326, 1-2, 17-25, https://doi.org/10.1016/S0040-6031(98)00585-1
. [all data]
Aldrich Chemical Company Inc., 1990
Aldrich Chemical Company Inc.,
Catalog Handbook of Fine Chemicals, Aldrich Chemical Company, Inc., Milwaukee WI, 1990, 1. [all data]
Williams, 1942
Williams, R.B.,
Heats of catalytic hydrogenation in solution. I. Apparatus, technique, and the heats of hydrogenation of certain pairs of stereoisomers,
J. Am. Chem. Soc., 1942, 64, 1395-1404. [all data]
Dass and Gross, 1983
Dass, C.; Gross, M.L.,
Electrocyclic ring opening of 1-phenylcyclobutene and 3-phenylcyclobutene radical cations,
J. Am. Chem. Soc., 1983, 105, 5724. [all data]
Koppel, Schwarz, et al., 1974
Koppel, C.; Schwarz, H.; Bohlmann, F.,
Elektronenstossinduzierte fragmentierung von acetylenverbindungen,
Org. Mass Spectrom., 1974, 9, 324. [all data]