Diphenylmethyl radical
- Formula: C13H11
- Molecular weight: 167.2264
- IUPAC Standard InChIKey: UIBVOXFCGWJCTC-UHFFFAOYSA-N
- CAS Registry Number: 4471-17-4
- Chemical structure:
View 3d structure (requires JavaScript / HTML 5) - Permanent link for this species. Use this link for bookmarking this species for future reference.

Gas phase ion energetics data

Data compiled as indicated in comments:
RDSH - Henry M. Rosenstock, Keith Draxl, Bruce W. Steiner, and John T. Herron
B - John E. Bartmess
Electron affinity determinations
EA (eV) | Method | Reference | Comment |
---|---|---|---|
1.36 ± 0.10 | D-EA | Bartmess, Scott, et al., 1979 | value altered from reference due to change in acidity scale; B |
0.85 ± 0.26 | SI | Gaines and Page, 1968 | The Magnetron method, lacking mass analysis, is not considered reliable.; B |
Ionization energy determinations
IE (eV) | Method | Reference | Comment |
---|---|---|---|
7.3 ± 0.1 | EI | Harrison and Lossing, 1960 | RDSH |

References

Bartmess, Scott, et al., 1979
Bartmess, J.E.; Scott, J.A.; McIver, R.T., Jr.,
The gas phase acidity scale from methanol to phenol,
J. Am. Chem. Soc., 1979, 101, 6047. [all data]
Gaines and Page, 1968
Gaines, A.F.; Page, F.M.,
The Stabilities of Negative Ions.I. The Methyl-, Diphenylmethyl, and Triphenylmethyl Negative Ions,
Int. J. Mass Spectrom. Ion Phys., 1968, 1, 4-5, 315, https://doi.org/10.1016/0020-7381(68)85008-9
. [all data]
Harrison and Lossing, 1960
Harrison, A.G.; Lossing, F.P.,
Free radicals by mass spectrometry. XVIII. The ionization potentials of conjugated hydrocarbon radicals and the resonance energies of radicals and carbonium ions,
J. Am. Chem. Soc., 1960, 82, 1052. [all data]