3,6-dichlorophthalic anhydride
- Formula: C8H2Cl2O3
- Molecular weight: 217.006
- IUPAC Standard InChIKey: HEGLMCPFDADCAQ-UHFFFAOYSA-N
- CAS Registry Number: 4466-59-5
- Chemical structure:
View 3d structure (requires JavaScript / HTML 5) - Permanent link for this species. Use this link for bookmarking this species for future reference.

Phase change data

Data compiled by: Robert L. Brown and Stephen E. Stein
Quantity | Value | Units | Method | Reference | Comment |
---|---|---|---|---|---|
Tboil | 612.2 | K | N/A | Weast and Grasselli, 1989 |

Gas phase ion energetics data

Data compiled as indicated in comments:
RDSH - Henry M. Rosenstock, Keith Draxl, Bruce W. Steiner, and John T. Herron
B - John E. Bartmess
Electron affinity determinations
EA (eV) | Method | Reference | Comment |
---|---|---|---|
1.670 ± 0.087 | IMRE | Paul and Kebarle, 1989 | ΔGea(423 K) = -37.2±1 kcal/mol, ΔS(est) = -3±3 eu; B |
Appearance energy determinations
Ion | AE (eV) | Other Products | Method | Reference | Comment |
---|---|---|---|---|---|
C6H2Cl2+ | 13.6 ± 0.2 | ? | EI | Grutzmacher and Hubner, 1969 | RDSH |

References

Weast and Grasselli, 1989
CRC Handbook of Data on Organic Compounds, 2nd Editon, Weast,R.C and Grasselli, J.G., ed(s)., CRC Press, Inc., Boca Raton, FL, 1989, 1. [all data]
Paul and Kebarle, 1989
Paul, G.; Kebarle, P.,
Electron Affinities of Cyclic Unsaturated Dicarbonyls: Maleic Anhydrides, Maleimides, and Cyclopentendione,
J. Am. Chem. Soc., 1989, 111, 2, 464, https://doi.org/10.1021/ja00184a009
. [all data]
Grutzmacher and Hubner, 1969
Grutzmacher, H.-F.; Hubner, J.,
Massenspektrometrie instabiler molekule. III: Nachweis und untersuchungen zur stabilitat chlorsubstituierter dehydrobenzole in der gasphase,
Org. Mass Spectrom., 1969, 2, 649. [all data]