Benzoyl isocyanate
- Formula: C8H5NO2
- Molecular weight: 147.1308
- IUPAC Standard InChIKey: LURYMYITPCOQAU-UHFFFAOYSA-N
- CAS Registry Number: 4461-33-0
- Chemical structure:
View 3d structure (requires JavaScript / HTML 5) - Other names: Methanone, 1-phenyl-1-isocyanato-

Phase change data

Data compiled by: Robert L. Brown and Stephen E. Stein
Quantity | Value | Units | Method | Reference | Comment |
---|---|---|---|---|---|
Tfus | 299. | K | N/A | Buckingham and Donaghy, 1982 |
Reduced pressure boiling point
Tboil (K) | Pressure (bar) | Reference |
---|---|---|
475. | 0.965 | Buckingham and Donaghy, 1982 |
361. to 364. | 0.027 | Buckingham and Donaghy, 1982 |

Gas phase ion energetics data

Data compiled by: Sharon G. Lias and Joel F. Liebman
Ionization energy determinations
IE (eV) | Method | Reference | Comment |
---|---|---|---|
9.6 | PE | Zverev, Il'yasov, et al., 1991 | Vertical value |

References

Buckingham and Donaghy, 1982
Buckingham, J.; Donaghy, S.M.,
Dictionary of Organic Compounds: Fifth Edition, Chapman and Hall, New York, 1982, 1. [all data]
Zverev, Il'yasov, et al., 1991
Zverev, V.V.; Il'yasov, A.V.; Aminova, R.M.; Zobova, N.N.; Sagitova, R.N.,
13C NMR spectra and photoelectron spectra of acyl isocyanates,
J. Gen. Chem. USSR, 1991, 61, 1031. [all data]