Silanamine, N-methyl-N-silyl-
- Formula: CH9NSi2
- Molecular weight: 91.2599
- IUPAC Standard InChIKey: HCZCGHSBNHRSLG-UHFFFAOYSA-N
- CAS Registry Number: 4459-06-7
- Chemical structure:
View 3d structure (requires JavaScript / HTML 5) - Permanent link for this species. Use this link for bookmarking this species for future reference.

Gas phase ion energetics data

Data compiled by: Sharon G. Lias, Rhoda D. Levin, and Sherif A. Kafafi
Ionization energy determinations
IE (eV) | Method | Reference | Comment |
---|---|---|---|
9.2 ± 0.1 | PE | Cradock, Ebsworth, et al., 1972 | Vertical value |

References

Cradock, Ebsworth, et al., 1972
Cradock, S.; Ebsworth, E.A.V.; Savage, W.J.; Whiteford, R.A.,
Photoelectron spectra of some methyl, silyl and germyl amines, phosphines and arsines,
J. Chem. Soc. Faraday Trans. 2, 1972, 68, 934. [all data]