1-Propanamine, N,N-diethyl-
- Formula: C7H17N
- Molecular weight: 115.2166
- IUPAC Standard InChIKey: PQZTVWVYCLIIJY-UHFFFAOYSA-N
- CAS Registry Number: 4458-31-5
- Chemical structure:
View 3d structure (requires JavaScript / HTML 5) - Other names: Propylamine, N,N-diethyl-; Diethylpropylamine; Ethanamine, N-ethyl-N-propyl-; (C2H5)2(n-C3H7)N; N-(n-Propyl)diethylamine; N,N-Diethyl-n-propylamine; Diethyl-n-propylamine; n-Propanamine, N,N-diethyl-

Phase change data

Data compiled by: Thermodynamics Research Center, NIST Boulder Laboratories, Chris Muzny director
Quantity | Value | Units | Method | Reference | Comment |
---|---|---|---|---|---|
Tboil | 385.2 | K | N/A | Elderfield, Kreysa, et al., 1948 | Uncertainty assigned by TRC = 1. K |
Tboil | 404.15 | K | N/A | Von Auwers and Mauss, 1928 | Uncertainty assigned by TRC = 2. K |

Gas phase ion energetics data

Data evaluated as indicated in comments:
HL - Edward P. Hunter and Sharon G. Lias
Data compiled as indicated in comments:
LLK - Sharon G. Lias, Rhoda D. Levin, and Sherif A. Kafafi
Quantity | Value | Units | Method | Reference | Comment |
---|---|---|---|---|---|
Proton affinity (review) | 978.8 | kJ/mol | N/A | Hunter and Lias, 1998 | HL |
Quantity | Value | Units | Method | Reference | Comment |
Gas basicity | 947.9 | kJ/mol | N/A | Hunter and Lias, 1998 | HL |
Ionization energy determinations
IE (eV) | Method | Reference | Comment |
---|---|---|---|
7.7 | PE | Aue and Bowers, 1979 | LLK |

Normal alkane RI, non-polar column, custom temperature program

Data compiled by: NIST Mass Spectrometry Data Center, William E. Wallace, director

Column type CapillaryCapillary
Active phase Polydimethyl siloxanesPolydimethyl siloxanes
Column length (m)
Carrier gas
Substrate
Column diameter (mm)
Phase thickness (μm)
Program not specifiednot specified
I 750.750.
ReferenceZenkevich, Chupalov, et al., 1996Zenkevich and Chupalov, 1996
Comment MSDC-RI MSDC-RI

Kovats' RI, non-polar column, isothermal

Data compiled by: NIST Mass Spectrometry Data Center, William E. Wallace, director

Column type PackedPackedPacked
Active phase Apiezon LApiezon LApiezon
Column length (m) 2.72.72.7
Carrier gas
Substrate Chromosorb G AW (80-100 mesh)Chromosorb G AW (80-100 mesh)
Column diameter (mm)
Phase thickness (μm)
Temperature (C) 80.80.100.
I 753.751.751.
ReferenceZhuravleva, Golovnya, et al., 1981Zhuravleva, Golovnya, et al., 1981Golovnya, Zhuravleva, et al., 1976
Comment MSDC-RI MSDC-RI MSDC-RI

References

Elderfield, Kreysa, et al., 1948
Elderfield, R.C.; Kreysa, F.J.; Dunn; Humphreys,
A study of the synthesis of plasmochin by the reductive amination method with raney nickel,
J. Am. Chem. Soc., 1948, 70, 40. [all data]
Von Auwers and Mauss, 1928
Von Auwers, K.; Mauss, W.,
On the Relative Resistance of Alkenes to Nitrogen,
Chem. Ber., 1928, 61, 2411. [all data]
Hunter and Lias, 1998
Hunter, E.P.; Lias, S.G.,
Evaluated Gas Phase Basicities and Proton Affinities of Molecules: An Update,
J. Phys. Chem. Ref. Data, 1998, 27, 3, 413-656, https://doi.org/10.1063/1.556018
. [all data]
Aue and Bowers, 1979
Aue, D.H.; Bowers, M.T.,
Chapter 9. Stabilities of positive ions from equilibrium gas phase basicity measurements
in Ions Chemistry,, ed. M.T. Bowers, 1979. [all data]