1,3-Hexadiyne
- Formula: C6H6
- Molecular weight: 78.1118
- IUPAC Standard InChIKey: AKOJBFZCIRFXBA-UHFFFAOYSA-N
- CAS Registry Number: 4447-21-6
- Chemical structure:
View 3d structure (requires JavaScript / HTML 5) - Permanent link for this species. Use this link for bookmarking this species for future reference.

Phase change data

Data compiled by: Robert L. Brown and Stephen E. Stein
Reduced pressure boiling point
Tboil (K) | Pressure (bar) | Reference |
---|---|---|
332.2 | 0.267 | Weast and Grasselli, 1989 |
300.2 | 0.024 | Weast and Grasselli, 1989 |

Gas phase ion energetics data

Data compiled as indicated in comments:
LBLHLM - Sharon G. Lias, John E. Bartmess, Joel F. Liebman, John L. Holmes, Rhoda D. Levin, and W. Gary Mallard
RDSH - Henry M. Rosenstock, Keith Draxl, Bruce W. Steiner, and John T. Herron
LLK - Sharon G. Lias, Rhoda D. Levin, and Sherif A. Kafafi
Ionization energy determinations
IE (eV) | Method | Reference | Comment |
---|---|---|---|
9.41 | PE | Rosenstock, Dannacher, et al., 1982 | LBLHLM |
9.25 | EI | Momigny, Brakier, et al., 1962 | RDSH |
Appearance energy determinations
Ion | AE (eV) | Other Products | Method | Reference | Comment |
---|---|---|---|---|---|
CH3+ | 18.50 | ? | EI | Momigny, Brakier, et al., 1962 | RDSH |
C3H3+ | ≤11.8 | C3H3 | PI | Dannacher, Stadelmann, et al., 1981 | LLK |
C3H3+ | 12.20 | ? | EI | Momigny, Brakier, et al., 1962 | RDSH |
C4H2+ | 12.2 ± 0.15 | C2H4 | PI | Dannacher, Stadelmann, et al., 1981 | LLK |
C4H2+ | 14.15 | ? | EI | Momigny, Brakier, et al., 1962 | RDSH |
C4H3+ | 14.0 ± 0.15 | C2H3 | PI | Dannacher, Stadelmann, et al., 1981 | LLK |
C4H3+ | 15.50 | ? | EI | Momigny, Brakier, et al., 1962 | RDSH |
C4H4+ | ≤11.8 | C2H2 | PI | Dannacher, Stadelmann, et al., 1981 | LLK |
C4H4+ | 12. | C2H2 | EI | Momigny, Brakier, et al., 1962 | RDSH |
C5H2+ | >17.0 | CH4 | PI | Dannacher, Stadelmann, et al., 1981 | LLK |
C5H3+ | 12.2 ± 0.15 | CH3 | PI | Dannacher, Stadelmann, et al., 1981 | LLK |
C6H3+ | 17.92 | H2+H | EI | Momigny, Brakier, et al., 1962 | RDSH |
C6H4+ | ≤11.8 | H2 | PI | Dannacher, Stadelmann, et al., 1981 | LLK |
C6H4+ | 11.07 | H2 | EI | Momigny, Brakier, et al., 1962 | RDSH |
C6H5+ | ≤11.8 | H | PI | Dannacher, Stadelmann, et al., 1981 | LLK |
C6H5+ | 11.50 | H | EI | Momigny, Brakier, et al., 1962 | RDSH |

Normal alkane RI, non-polar column, custom temperature program

View large format table.

Column type Active phase I Reference Comment
CapillaryMethyl Silicone688.Zenkevich, 1998Program: not specified

References

Weast and Grasselli, 1989
CRC Handbook of Data on Organic Compounds, 2nd Editon, Weast,R.C and Grasselli, J.G., ed(s)., CRC Press, Inc., Boca Raton, FL, 1989, 1. [all data]
Rosenstock, Dannacher, et al., 1982
Rosenstock, H.M.; Dannacher, J.; Liebman, J.F.,
The role of excited electronic states in ion fragmentation: C6H6+,
Radiat. Phys. Chem., 1982, 20, 7. [all data]
Momigny, Brakier, et al., 1962
Momigny, J.; Brakier, L.; D'Or, L.,
Comparaison entre les effets de l'impact electronique sur le benzene et sur les isomeres du benzene en chaine ouverte,
Bull. Classe Sci. Acad. Roy. Belg., 1962, 48, 1002. [all data]
Dannacher, Stadelmann, et al., 1981
Dannacher, J.; Stadelmann, J.P.; Vogt, J.,
On the decay of electronically excited 1,3-hexadiyne cations,
Int. J. Mass Spectrom. Ion Processes, 1981, 38, 69. [all data]