1H-2-Benzothiopyran, 3,4-dihydro-
- Formula: C9H10S
- Molecular weight: 150.241
- IUPAC Standard InChIKey: ZZQUQFZVCJWSER-UHFFFAOYSA-N
- CAS Registry Number: 4426-75-9
- Chemical structure:
View 3d structure (requires JavaScript / HTML 5) - Other names: Isothiochroman; Thioisochroman; 3,4-Dihydro-1H-2-benzothiopyran

Gas phase ion energetics data

Data compiled by: Henry M. Rosenstock, Keith Draxl, Bruce W. Steiner, and John T. Herron
Ionization energy determinations
IE (eV) | Method | Reference |
---|---|---|
8.70 | EI | Loudon, Maccoll, et al., 1970 |
Appearance energy determinations
Ion | AE (eV) | Other Products | Method | Reference | Comment |
---|---|---|---|---|---|
C8H8+ | 10.87 | ? | EI | Loudon, Maccoll, et al., 1970 |

References

Loudon, Maccoll, et al., 1970
Loudon, A.G.; Maccoll, A.; Wong, S.K.,
Comparison between unimolecular gas phase pyrolysis and electron impact fragmentation. Part I. The mass spectra of tetralin and some related heterocycles,
J. Chem. Soc. B, 1970, 1727. [all data]