Harmine

Phase change data

Data compiled by: William E. Acree, Jr., James S. Chickos

Enthalpy of fusion

ΔfusH (kcal/mol) Temperature (K) Method Reference
11.7536.6DSCBurrows, Miguel, et al., 1996

Gas phase ion energetics data

Data compiled by: Sharon G. Lias, Rhoda D. Levin, and Sherif A. Kafafi

Ionization energy determinations

IE (eV) Method Reference Comment
7.78 ± 0.06PEDomelsmith and Houk, 1978Vertical value

Normal alkane RI, non-polar column, custom temperature program

View large format table.

Column type Active phase I Reference Comment
OtherMethyl Silicone2291.Ardrey and Moffat, 1981Program: not specified

References

Burrows, Miguel, et al., 1996
Burrows, Hugh D.; Miguel, Maria da Graça M.; Varela, A. Paula; Becker, Ralph S., The aqueous solubility and thermal behaviour of some β-carbolines, Thermochimica Acta, 1996, 279, 77-82, https://doi.org/10.1016/S0040-6031(96)90063-5 . [all data]

Domelsmith and Houk, 1978
Domelsmith, L.N.; Houk, K.N., Photoelectron spectroscopic studies of hallucinogens: The use of ionization potentials in QSAR, NIDA Res. Monogr., 1978, 22, 423. [all data]

Ardrey and Moffat, 1981
Ardrey, R.E.; Moffat, A.C., Gas-liquid chromatographic retention indices of 1318 substances of toxicological interest on SE-30 or OV-1 stationary phase, J. Chromatogr., 1981, 220, 3, 195-252, https://doi.org/10.1016/S0021-9673(00)81925-1 . [all data]