α-Ketocyclododecanone oxime
- Formula: C12H21NO2
- Molecular weight: 211.3006
- IUPAC Standard InChIKey: DFZPTACRIAQCIW-UHFFFAOYSA-N
- CAS Registry Number: 4422-06-4
- Chemical structure:
View 3d structure (requires JavaScript / HTML 5) - Other names: 1,2-Cyclododecandione, monooxime

Gas phase ion energetics data

Data compiled as indicated in comments:
LLK - Sharon G. Lias, Rhoda D. Levin, and Sherif A. Kafafi
Ionization energy determinations
IE (eV) | Method | Reference | Comment |
---|---|---|---|
8.99 ± 0.03 | PI | Golubitskii, Kulikov, et al., 1979 | LLK |

References

Golubitskii, Kulikov, et al., 1979
Golubitskii, A.E.; Kulikov, N.S.; Zyakun, A.M.; Valovoi, V.A.; Alekseev, A.M.; Volkov, V.N.,
Photoionization mass spectra of alicyclic compounds with various substituents, and their ionization energies and appearance energies,
Bull. Acad. Sci. USSR, Div. Chem. Sci., 1979, 11, 2602. [all data]