Tetrakis(diethylamino)titanium
- Formula: C16H40N4Ti
- Molecular weight: 336.383
- IUPAC Standard InChIKey: VJDVOZLYDLHLSM-UHFFFAOYSA-N
- CAS Registry Number: 4419-47-0
- Chemical structure:
View 3d structure (requires JavaScript / HTML 5) - Permanent link for this species. Use this link for bookmarking this species for future reference.

Gas phase thermochemistry data

Data compiled by: José A. Martinho Simões
Quantity | Value | Units | Method | Reference | Comment |
---|---|---|---|---|---|
ΔfH°gas | -628.2 ± 9.6 | kJ/mol | Review | Martinho Simões | |
ΔfH°gas | -410. ± 18. | kJ/mol | Review | Martinho Simões | |
ΔfH°gas | -392.3 ± 7.1 | kJ/mol | Review | Martinho Simões | The enthalpy of formation relies on -1461.2 ± 3.1 kJ/mol for the enthalpy of formation of Ti(OEt)4(l) |
ΔfH°gas | -403.4 ± 8.1 | kJ/mol | Review | Martinho Simões | The enthalpy of formation relies on -1579.0 ± 3.9 kJ/mol for the enthalpy of formation of Ti(O-i-Pr)4(l) |

Condensed phase thermochemistry data

Data compiled by: José A. Martinho Simões
Quantity | Value | Units | Method | Reference | Comment |
---|---|---|---|---|---|
ΔfH°liquid | -722.8 ± 8.7 | kJ/mol | Review | Martinho Simões | |
ΔfH°liquid | -505. ± 18. | kJ/mol | Review | Martinho Simões | |
ΔfH°liquid | -486.9 ± 5.9 | kJ/mol | Review | Martinho Simões | The enthalpy of formation relies on -1461.2 ± 3.1 kJ/mol for the enthalpy of formation of Ti(OEt)4(l) |
ΔfH°liquid | -498.0 ± 7.1 | kJ/mol | Review | Martinho Simões | The enthalpy of formation relies on -1579.0 ± 3.9 kJ/mol for the enthalpy of formation of Ti(O-i-Pr)4(l) |
Quantity | Value | Units | Method | Reference | Comment |
ΔcH°liquid | -12452. ± 18. | kJ/mol | CC-SB | Makhailov, Baev, et al., 1986 | |
ΔcH°liquid | -12234.0 ± 8.4 | kJ/mol | CC-SB | Kol'yakova, Rabinovich, et al., 1971 | Please also see Pedley and Rylance, 1977. |

Phase change data

Data compiled by: José A. Martinho Simões
Quantity | Value | Units | Method | Reference | Comment |
---|---|---|---|---|---|
ΔvapH° | 94.6 ± 4.0 | kJ/mol | CC-SB | Baev, Mikhailov, et al., 1985 |

Gas phase ion energetics data

Data compiled by: Sharon G. Lias, Rhoda D. Levin, and Sherif A. Kafafi
Ionization energy determinations
IE (eV) | Method | Reference | Comment |
---|---|---|---|
6.83 | PE | Gibbins, Lappert, et al., 1975 | Vertical value |

References

Martinho Simões
Martinho Simões, J.A.,
Private communication (see http://webbook.nist.gov/chemistry/om/). [all data]
Makhailov, Baev, et al., 1986
Makhailov, V.E.; Baev, A.K.; Sachek, A.I.; Al'khimovich, V.M.,
Zh. Fiz. Khim., 1986, 60, 2306. [all data]
Kol'yakova, Rabinovich, et al., 1971
Kol'yakova, G.M.; Rabinovich, I.B.; Vyazanken, N.S.,
Dokl. Akad. Nauk SSSR, 1971, 200, 735. [all data]
Pedley and Rylance, 1977
Pedley, J.B.; Rylance, J.,
Computer Analysed Thermochemical Data: Organic and Organometallic Compounds, University of Sussex, Brigton, 1977. [all data]
Baev, Mikhailov, et al., 1985
Baev, A.K.; Mikhailov, V.E.; Baev, A.A.,
Izv. Vyssh. Uchebn. Zaved., Khim. Khim. Tekhnol., 1985, 28, 115. [all data]
Gibbins, Lappert, et al., 1975
Gibbins, S.G.; Lappert, M.F.; Pedley, J.B.; Sharp, G.J.,
Bonding studies of transition-metal complexes. Part II. Helium-I photoelectron spectra of homoleptic d0, d1, and d10 tetrakis(dialkylamides) of transition group 4B metals tungsten hexakis(dimethylamide),
J. Chem. Soc. Dalton Trans., 1975, 72. [all data]