1-Phenylethenol
- Formula: C8H8O
- Molecular weight: 120.1485
- IUPAC Standard InChIKey: VEIIEWOTAHXGKS-UHFFFAOYSA-N
- CAS Registry Number: 4383-15-7
- Chemical structure:
View 3d structure (requires JavaScript / HTML 5) - Permanent link for this species. Use this link for bookmarking this species for future reference.

Gas phase thermochemistry data

Data compiled by: Hussein Y. Afeefy, Joel F. Liebman, and Stephen E. Stein
Quantity | Value | Units | Method | Reference | Comment |
---|---|---|---|---|---|
ΔfH°gas | -46. ± 6. | kJ/mol | Ion | Turecek, 1986 |

Gas phase ion energetics data

Data compiled by: Sharon G. Lias, John E. Bartmess, Joel F. Liebman, John L. Holmes, Rhoda D. Levin, and W. Gary Mallard
Ionization energy determinations
IE (eV) | Method | Reference |
---|---|---|
8.01 ± 0.03 | EI | Turecek, 1986, 2 |

References

Turecek, 1986
Turecek, F.,
1-Phenylethenol: The enol form of acetophenone. Preparation, ionization energy and the heat of formation in the gas phase,
Tetrahedron Lett., 1986, 27, 4219-4222. [all data]
Turecek, 1986, 2
Turecek, F.,
1-Phenylethenol: The enol form of acetophenone. Preparation, ionization energy, and the heat of formation in the gas phase,
Tetrahedron Lett., 1986, 27, 4219. [all data]