Methoxymethyl formate
- Formula: C3H6O3
- Molecular weight: 90.0779
- IUPAC Standard InChIKey: VKWJMTLAAJULGF-UHFFFAOYSA-N
- CAS Registry Number: 4382-75-6
- Chemical structure:
View 3d structure (requires JavaScript / HTML 5) - Permanent link for this species. Use this link for bookmarking this species for future reference.

Gas phase ion energetics data

Data compiled as indicated in comments:
LL - Sharon G. Lias and Joel F. Liebman
LBLHLM - Sharon G. Lias, John E. Bartmess, Joel F. Liebman, John L. Holmes, Rhoda D. Levin, and W. Gary Mallard
Appearance energy determinations
Ion | AE (eV) | Other Products | Method | Reference | Comment |
---|---|---|---|---|---|
CHO2+ | 10.60 | C2H5O | EI | Holmes, Lossing, et al., 1991 | LL |
C2H4O+[CH2OCH2+] | 10.49 ± 0.05 | CH2O2 | EI | Buschek, Holmes, et al., 1987 | LBLHLM |

References

Holmes, Lossing, et al., 1991
Holmes, J.L.; Lossing, F.P.; Mayer, P.M.,
Heats of formation of oxygen-containing organic free radicals from appearance energy measurements,
J. Am. Chem. Soc., 1991, 113, 9723. [all data]
Buschek, Holmes, et al., 1987
Buschek, J.M.; Holmes, J.L.; Terlouw, J.K.,
CH3OCH+, a new stable C2H4O+ isomer, and a reassessment of the oxirane+ potential surface,
J. Am. Chem. Soc., 1987, 109, 7321. [all data]