2-iodopropene
- Formula: C3H5I
- Molecular weight: 167.9763
- IUPAC Standard InChIKey: KWAHADSKPFGJQF-UHFFFAOYSA-N
- CAS Registry Number: 4375-96-6
- Chemical structure:
View 3d structure (requires JavaScript / HTML 5) - Other names: 1-Propene, 2-iodo-

Gas phase ion energetics data

Data compiled by: Sharon G. Lias, John E. Bartmess, Joel F. Liebman, John L. Holmes, Rhoda D. Levin, and W. Gary Mallard
Appearance energy determinations
Ion | AE (eV) | Other Products | Method | Reference | Comment |
---|---|---|---|---|---|
C3H5+ | 10.30 | I | EI | Lossing and Holmes, 1984 |

References

Lossing and Holmes, 1984
Lossing, F.P.; Holmes, J.L.,
Stabilization energy and ion size in carbocations in the gas phase,
J. Am. Chem. Soc., 1984, 106, 6917. [all data]