2-Phenylethenol
- Formula: C8H8O
- Molecular weight: 120.1485
- IUPAC Standard InChIKey: XLLXMBCBJGATSP-VOTSOKGWSA-N
- CAS Registry Number: 4365-04-2
- Chemical structure:
View 3d structure (requires JavaScript / HTML 5) - Permanent link for this species. Use this link for bookmarking this species for future reference.

Gas phase ion energetics data

Data compiled as indicated in comments:
LLK - Sharon G. Lias, Rhoda D. Levin, and Sherif A. Kafafi
Ionization energy determinations
IE (eV) | Method | Reference | Comment |
---|---|---|---|
8.7 ± 0.1 | EI | Dallinga, Nibbering, et al., 1981 | LLK |

References

Dallinga, Nibbering, et al., 1981
Dallinga, J.W.; Nibbering, N.M.M.; Louter, G.J.,
Formation and structure of [C8H8O]+ ions, generated from gas phase ions of phenylcyclopropylcarbinol and 1-phenyl-1-(hydroxymethyl)cyclopropane,
Org. Mass Spectrom., 1981, 16, 4. [all data]