2H-1,4-Ethanoquinoline, 3,4-dihydro-
- Formula: C11H13N
- Molecular weight: 159.2276
- IUPAC Standard InChIKey: RNFRFPSSWGWDKI-UHFFFAOYSA-N
- CAS Registry Number: 4363-25-1
- Chemical structure:
View 3d structure (requires JavaScript / HTML 5) - Other names: Benzoquinuclidine; 3,4-Dihydro-2H-1,4-ethanoquinoline; 1,4-Dihydro-1,4-Ethanoquinoline

Gas phase ion energetics data

Data evaluated as indicated in comments:
HL - Edward P. Hunter and Sharon G. Lias
Data compiled as indicated in comments:
LLK - Sharon G. Lias, Rhoda D. Levin, and Sherif A. Kafafi
Quantity | Value | Units | Method | Reference | Comment |
---|---|---|---|---|---|
Proton affinity (review) | 979.8 | kJ/mol | N/A | Hunter and Lias, 1998 | HL |
Quantity | Value | Units | Method | Reference | Comment |
Gas basicity | 948.8 | kJ/mol | N/A | Hunter and Lias, 1998 | HL |
Ionization energy determinations
IE (eV) | Method | Reference | Comment |
---|---|---|---|
7.85 ± 0.02 | PE | Maier and Turner, 1973 | LLK |

References

Hunter and Lias, 1998
Hunter, E.P.; Lias, S.G.,
Evaluated Gas Phase Basicities and Proton Affinities of Molecules: An Update,
J. Phys. Chem. Ref. Data, 1998, 27, 3, 413-656, https://doi.org/10.1063/1.556018
. [all data]
Maier and Turner, 1973
Maier, J.P.; Turner, D.W.,
Steric inhibition of resonance studied by molecular photoelectron spectroscopy Part 3. Anilines, Phenols and Related Compounds,
J. Chem. Soc. Faraday Trans. 2, 1973, 69, 521. [all data]
Wepster, 1952
Wepster, B.M.,
Rec. trav. chim., 1952, 71, 1159. [all data]