1,2-Dioxolane
- Formula: C3H6O2
- Molecular weight: 74.0785
- IUPAC Standard InChIKey: SNQXJPARXFUULZ-UHFFFAOYSA-N
- CAS Registry Number: 4362-13-4
- Chemical structure:
View 3d structure (requires JavaScript / HTML 5) - Permanent link for this species. Use this link for bookmarking this species for future reference.

Gas phase thermochemistry data

Data compiled by: Glushko Thermocenter, Russian Academy of Sciences, Moscow
Constant pressure heat capacity of gas
Cp,gas (J/mol*K) | Temperature (K) | Reference | Comment |
---|---|---|---|
33.61 | 50. | Dorofeeva O.V., 1992 | p=1 bar. |
38.11 | 100. | ||
44.68 | 150. | ||
53.35 | 200. | ||
70.39 | 273.15 | ||
77.0 ± 4.0 | 298.15 | ||
77.44 | 300. | ||
103.70 | 400. | ||
126.62 | 500. | ||
145.32 | 600. | ||
160.54 | 700. | ||
173.11 | 800. | ||
183.63 | 900. | ||
192.51 | 1000. | ||
200.05 | 1100. | ||
206.50 | 1200. | ||
212.02 | 1300. | ||
216.78 | 1400. | ||
220.89 | 1500. |

Gas phase ion energetics data

Data compiled as indicated in comments:
LLK - Sharon G. Lias, Rhoda D. Levin, and Sherif A. Kafafi
Appearance energy determinations
Ion | AE (eV) | Other Products | Method | Reference | Comment |
---|---|---|---|---|---|
C3H6O2+ | 9.86 | 88 | PE | Coughlin, Brown, et al., 1979 | Vertical value; LLK |

References

Dorofeeva O.V., 1992
Dorofeeva O.V.,
Ideal gas thermodynamic properties of oxygen heterocyclic compounds. Part 1. Three-membered, four-membered and five-membered rings,
Thermochim. Acta, 1992, 194, 9-46. [all data]
Coughlin, Brown, et al., 1979
Coughlin, D.J.; Brown, R.S.; Salomon, R.G.,
The prostaglandin endoperoxide nucleus and related bicyclic peroxides. Synthetic and spectroscopic studies,
J. Am. Chem. Soc., 1979, 101, 1533. [all data]