2-Propenenitrile, 2,3,3-trifluoro-
- Formula: C3F3N
- Molecular weight: 107.0340
- IUPAC Standard InChIKey: KDUAIKFAYXQCMF-UHFFFAOYSA-N
- CAS Registry Number: 433-43-2
- Chemical structure:
View 3d structure (requires JavaScript / HTML 5) - Other names: Acrylonitrile, trifluoro-; Perfluoroacrylonitrile; CF2=CFCN

Gas phase ion energetics data

Data compiled as indicated in comments:
RDSH - Henry M. Rosenstock, Keith Draxl, Bruce W. Steiner, and John T. Herron
Ionization energy determinations
IE (eV) | Method | Reference | Comment |
---|---|---|---|
10.6 ± 0.1 | EI | Chelobov, Dubov, et al., 1969 | RDSH |
Appearance energy determinations
Ion | AE (eV) | Other Products | Method | Reference | Comment |
---|---|---|---|---|---|
CF+ | 13.3 ± 0.1 | ? | EI | Chelobov, Dubov, et al., 1969 | RDSH |
C2NF+ | 15.1 ± 0.1 | ? | EI | Chelobov, Dubov, et al., 1969 | RDSH |
C2NF2+ | 14.9 ± 0.1 | ? | EI | Chelobov, Dubov, et al., 1969 | RDSH |
C3NF2+ | 14.3 ± 0.1 | F | EI | Chelobov, Dubov, et al., 1969 | RDSH |

References

Chelobov, Dubov, et al., 1969
Chelobov, F.N.; Dubov, S.S.; Tikhomirov, M.V.; Dobrovitskii, M.I.; Gitel', P.O.; Rozenshtein, S.M.,
Processes in fluoroacrylonitriles under electron impact,
Zh. Fiz. Khim., 1969, 43, 33, In original 15. [all data]