Cyclopropyl bromide
- Formula: C3H5Br
- Molecular weight: 120.976
- IUPAC Standard InChIKey: LKXYJYDRLBPHRS-UHFFFAOYSA-N
- CAS Registry Number: 4333-56-6
- Chemical structure:
View 3d structure (requires JavaScript / HTML 5) - Other names: Bromocyclopropane; Cyclopropane, bromo-

Phase change data

Data compiled by: Robert L. Brown and Stephen E. Stein
Quantity | Value | Units | Method | Reference | Comment |
---|---|---|---|---|---|
Tboil | 342. | K | N/A | Buckingham and Donaghy, 1982 |

Gas phase ion energetics data

Data compiled as indicated in comments:
LLK - Sharon G. Lias, Rhoda D. Levin, and Sherif A. Kafafi
RDSH - Henry M. Rosenstock, Keith Draxl, Bruce W. Steiner, and John T. Herron
Ionization energy determinations
IE (eV) | Method | Reference | Comment |
---|---|---|---|
9.6 | PE | Kimura, Katsumata, et al., 1981 | LLK |
9.53 | PE | Hashmall and Heilbronner, 1970 | RDSH |
9.93 | PE | Kimura, Katsumata, et al., 1981 | Vertical value; LLK |

References

Buckingham and Donaghy, 1982
Buckingham, J.; Donaghy, S.M.,
Dictionary of Organic Compounds: Fifth Edition, Chapman and Hall, New York, 1982, 1. [all data]
Kimura, Katsumata, et al., 1981
Kimura, K.; Katsumata, S.; Achiba, Y.; Yamazaki, T.; Iwata, S.,
Ionization energies, Ab initio assignments, and valence electronic structure for 200 molecules
in Handbook of HeI Photoelectron Spectra of Fundamental Organic Compounds, Japan Scientific Soc. Press, Tokyo, 1981. [all data]
Hashmall and Heilbronner, 1970
Hashmall, J.A.; Heilbronner, E.,
n-Ionization potentials of alkyl bromides,
Angew. Chem. Intern. Ed., 1970, 9, 305. [all data]