Phosphine, tris(trifluoromethyl)-
- Formula: C3F9P
- Molecular weight: 237.9915
- IUPAC Standard InChIKey: MXLDRFIVBLWESA-UHFFFAOYSA-N
- CAS Registry Number: 432-04-2
- Chemical structure:
View 3d structure (requires JavaScript / HTML 5) - Other names: Tris(trifluoromethyl)phosphine

Phase change data

Data compiled by: William E. Acree, Jr., James S. Chickos
Enthalpy of vaporization
ΔvapH (kJ/mol) | Temperature (K) | Method | Reference | Comment |
---|---|---|---|---|
24.7 | 270. | A | Stephenson and Malanowski, 1987 | Based on data from 248. to 285. K. |

Gas phase ion energetics data

Data compiled as indicated in comments:
LBLHLM - Sharon G. Lias, John E. Bartmess, Joel F. Liebman, John L. Holmes, Rhoda D. Levin, and W. Gary Mallard
LLK - Sharon G. Lias, Rhoda D. Levin, and Sherif A. Kafafi
RDSH - Henry M. Rosenstock, Keith Draxl, Bruce W. Steiner, and John T. Herron
Ionization energy determinations
IE (eV) | Method | Reference | Comment |
---|---|---|---|
11.1 | PE | Elbel, Dieck, et al., 1982 | LBLHLM |
11.3 ± 0.1 | EI | Cullen and Frost, 1962 | RDSH |
11.57 | PE | Elbel, Dieck, et al., 1982 | Vertical value; LBLHLM |
11.70 | PE | Cowley, Dewar, et al., 1975 | Vertical value; LLK |
11.70 | PE | Cowley, Dewar, et al., 1974 | Vertical value; LLK |
11.70 | PE | Cowley, Dewar, et al., 1974, 2 | Vertical value; LLK |

References

Stephenson and Malanowski, 1987
Stephenson, Richard M.; Malanowski, Stanislaw,
Handbook of the Thermodynamics of Organic Compounds, 1987, https://doi.org/10.1007/978-94-009-3173-2
. [all data]
Elbel, Dieck, et al., 1982
Elbel, S.; Dieck, H.T.; Demuth, R.,
Photoelectron sSpectra of group V compounds. IX. The relative perfluoroalkyl substituent effect,
J. Fluorine Chem., 1982, 19, 349. [all data]
Cullen and Frost, 1962
Cullen, W.R.; Frost, D.C.,
Ionization potentials of some perfluoroalkyl arsines,
Can. J. Chem., 1962, 40, 390. [all data]
Cowley, Dewar, et al., 1975
Cowley, A.H.; Dewar, M.J.S.; Goodman, D.W.,
Molecular photoelectron spectroscopic studies of some trifluoromethyl-substituted phosphines and chlorophosphines,
J. Am. Chem. Soc., 1975, 97, 3653. [all data]
Cowley, Dewar, et al., 1974
Cowley, A.H.; Dewar, M.J.S.; Goodman, D.W.; Padolina, M.C.,
A photoelectron spectroscopic study of polyphosphines. The question of pπ:dπ bonding,
J. Am. Chem. Soc., 1974, 96, 3666. [all data]
Cowley, Dewar, et al., 1974, 2
Cowley, A.H.; Dewar, M.J.S.; Gilje, J.W.; Goodman, D.W.; Schweiger, J.R.,
Relationship between the photoelectron spectra and torsional barriers of aminophosphines,
J. Chem. Soc., Chem. Commun., 1974, 340. [all data]