Stannane, trimethyl(phenylmethyl)-
- Formula: C10H16Sn
- Molecular weight: 254.944
- IUPAC Standard InChIKey: HJSFAHKFVZTLRU-UHFFFAOYSA-N
- CAS Registry Number: 4314-94-7
- Chemical structure:

Gas phase thermochemistry data

Data compiled by: José A. Martinho Simões
Quantity | Value | Units | Method | Reference | Comment |
---|---|---|---|---|---|
ΔfH°gas | 82.7 ± 6.3 | kJ/mol | Review | Martinho Simões | The enthalpy of formation relies on -185.5 ± 3.7 kJ/mol for the enthalpy of formation of Sn(Me)3(Br)(l). |

Reaction thermochemistry data

Data compiled by: José A. Martinho Simões
Individual Reactions
(l) +
(g) =
(l) + C3H9BrSn (l)
By formula: C10H16Sn (l) + Br2 (g) = C7H7Br (l) + C3H9BrSn (l)
Quantity | Value | Units | Method | Reference | Comment |
---|---|---|---|---|---|
ΔrH° | -226.6 ± 0.9 | kJ/mol | RSC | Pedley and Skinner, 1959 | Please also see Pedley and Rylance, 1977 and Cox and Pilcher, 1970. |

Gas phase ion energetics data

Data compiled as indicated in comments:
LLK - Sharon G. Lias, Rhoda D. Levin, and Sherif A. Kafafi
Ionization energy determinations
IE (eV) | Method | Reference | Comment |
---|---|---|---|
8.08 ± 0.05 | PE | Distefano, Pignataro, et al., 1974 | LLK |
7.91 | CTS | Pitt, 1973 | LLK |
8.1 | PE | Schweig, Weidner, et al., 1974 | Vertical value; LLK |
8.21 | PE | Bischof, Dewar, et al., 1974 | Vertical value; LLK |

Condensed phase thermochemistry data

Data compiled by: José A. Martinho Simões
Quantity | Value | Units | Method | Reference | Comment |
---|---|---|---|---|---|
ΔfH°liquid | 26.2 ± 4.7 | kJ/mol | Review | Martinho Simões | The enthalpy of formation relies on -185.5 ± 3.7 kJ/mol for the enthalpy of formation of Sn(Me)3(Br)(l). |

Phase change data

Data compiled by: José A. Martinho Simões
Quantity | Value | Units | Method | Reference | Comment |
---|---|---|---|---|---|
ΔvapH° | 56.5 ± 4.2 | kJ/mol | RSC | Davies, Pope, et al., 1963 |

References

Martinho Simões
Martinho Simões, J.A.,
Private communication (see http://webbook.nist.gov/chemistry/om/). [all data]
Pedley and Skinner, 1959
Pedley, J.B.; Skinner, H.A.,
Thermochemistry of metallic alkyls. Part 9.?Heats of bromination of some organo-tin compounds,
Trans. Faraday Soc., 1959, 55, 544, https://doi.org/10.1039/tf9595500544
. [all data]
Pedley and Rylance, 1977
Pedley, J.B.; Rylance, J.,
Computer Analysed Thermochemical Data: Organic and Organometallic Compounds, University of Sussex, Brigton, 1977. [all data]
Cox and Pilcher, 1970
Cox, J.D.; Pilcher, G.,
Thermochemistry of Organic and Organometallic Compounds
in Academic Press, New York, 1970. [all data]
Distefano, Pignataro, et al., 1974
Distefano, G.; Pignataro, S.; Ricci, A.; Colonna, F.P.; Pietropaolo, D.,
Interactions of π-orbitals with the group IV elements studied by ionization energy measurements,
Ann. Chim., 1974, 64, 153. [all data]
Pitt, 1973
Pitt, C.G.,
Hyperconjugation and its role in group IV chemistry,
J. Organomet. Chem., 1973, 61, 49. [all data]
Schweig, Weidner, et al., 1974
Schweig, A.; Weidner, U.; Manuel, G.,
Theory and application of photoelectron spectroscopy. XLIV. A quantitative account of hyperconjugation in allyl and benzyl compounds of elements of Group IVB,
J. Organomet. Chem., 1974, 67, 4. [all data]
Bischof, Dewar, et al., 1974
Bischof, P.K.; Dewar, M.J.S.; Goodman, D.W.; Jones, T.B.,
Photoelectron spectra of molecules. VI. Hyperconjugation versus pπ-dπ bonding in group IVb compounds,
J. Organomet. Chem., 1974, 82, 89. [all data]