1-Bromo-3,3,3-trifluoroacetone
- Formula: C3H2BrF3O
- Molecular weight: 190.947
- IUPAC Standard InChIKey: ONZQYZKCUHFORE-UHFFFAOYSA-N
- CAS Registry Number: 431-35-6
- Chemical structure:
View 3d structure (requires JavaScript / HTML 5) - Other names: 3-Bromo-1,1,1-trifluoropropanone; 3-Bromo-1,1,1-trifluoro-2-propanone; 2-Propanone, 3-bromo-1,1,1-trifluoro-; 3-Bromo-1,1,1-trifluoroacetone

Phase change data

Data compiled by: Robert L. Brown and Stephen E. Stein
Quantity | Value | Units | Method | Reference | Comment |
---|---|---|---|---|---|
Tboil | 358. to 360. | K | N/A | PCR Inc., 1990 |

Gas phase ion energetics data

Data compiled by: Sharon G. Lias, Rhoda D. Levin, and Sherif A. Kafafi
Ionization energy determinations
IE (eV) | Method | Reference | Comment |
---|---|---|---|
10.92 ± 0.02 | PE | Young and Cheng, 1976 | Vertical value |

References

PCR Inc., 1990
PCR Inc.,
Research Chemicals Catalog 1990-1991, PCR Inc., Gainesville, FL, 1990, 1. [all data]
Young and Cheng, 1976
Young, V.Y.; Cheng, K.L.,
The photoelectron spectra of halogen substituted acetones,
J. Chem. Phys., 1976, 65, 3187. [all data]