2,3-Butanedione
- Formula: C4H6O2
- Molecular weight: 86.0892
- IUPAC Standard InChIKey: QSJXEFYPDANLFS-UHFFFAOYSA-N
- CAS Registry Number: 431-03-8
- Chemical structure:
View 3d structure (requires JavaScript / HTML 5) - Species with the same structure:
- Other names: Biacetyl; Butane-2,3-dione; Butanedione; Diacetyl; Dimethyl diketone; Dimethyl glyoxal; 2,3-Butadione; 2,3-Diketobutane; (CH3CO)2; Glyoxal, dimethyl-; Butadione; UN 2346; 2,3-Dioxobutane; 2,3-Butandione; Buta-2,3-dione; Butan-2,3-dione; NSC 8750; butane-2,3-dione (diacetyl); 2,3-butanedione (diacetal); 2,3-butanedione (diacetyl); Butan-2,3-dione (diacetyl); Butanedione (diacetyl); 2,3 Butandione (Diacetyl); 2,3-butanodione

Gas phase thermochemistry data

Data compiled by: Hussein Y. Afeefy, Joel F. Liebman, and Stephen E. Stein
Quantity | Value | Units | Method | Reference | Comment |
---|---|---|---|---|---|
ΔfH°gas | -326.8 | kJ/mol | Ccb | Nicholson, Szwarc, et al., 1954 |

Condensed phase thermochemistry data

Data compiled by: Hussein Y. Afeefy, Joel F. Liebman, and Stephen E. Stein
Quantity | Value | Units | Method | Reference | Comment |
---|---|---|---|---|---|
ΔfH°liquid | -365.5 | kJ/mol | Ccb | Nicholson, Szwarc, et al., 1954 | |
Quantity | Value | Units | Method | Reference | Comment |
ΔcH°liquid | -2066.1 ± 0.79 | kJ/mol | Ccb | Nicholson, Szwarc, et al., 1954 | Corresponding ΔfHºliquid = -365.4 kJ/mol (simple calculation by NIST; no Washburn corrections) |

Phase change data

Data compiled as indicated in comments:
BS - Robert L. Brown and Stephen E. Stein
TRC - Thermodynamics Research Center, NIST Boulder Laboratories, Chris Muzny director
ALS - Hussein Y. Afeefy, Joel F. Liebman, and Stephen E. Stein
AC - William E. Acree, Jr., James S. Chickos
Quantity | Value | Units | Method | Reference | Comment |
---|---|---|---|---|---|
Tboil | 361.2 | K | N/A | Weast and Grasselli, 1989 | BS |
Tboil | 361.15 | K | N/A | Othmer, 1943 | Uncertainty assigned by TRC = 1. K; TRC |
Tboil | 361.15 | K | N/A | Sabatier and Mailhe, 1909 | Uncertainty assigned by TRC = 2. K; TRC |
Tboil | 360.15 | K | N/A | Sabatier and Mailhe, 1907 | Uncertainty assigned by TRC = 2. K; TRC |
Quantity | Value | Units | Method | Reference | Comment |
ΔvapH° | 38.7 ± 0.92 | kJ/mol | V | Nicholson, Szwarc, et al., 1954 | ALS |
Enthalpy of vaporization
ΔvapH (kJ/mol) | Temperature (K) | Method | Reference | Comment |
---|---|---|---|---|
38.5 | 288. | A,I | Stephenson and Malanowski, 1987 | Based on data from 273. to 348. K. See also Neely and Hall, 1972.; AC |
39.6 ± 0.2 | 283. | N/A | Nicholson, Szwarc, et al., 1954, 2 | Based on data from 273. to 293. K.; AC |
Antoine Equation Parameters
log10(P) = A − (B / (T + C))
P = vapor pressure (bar)
T = temperature (K)
View plot Requires a JavaScript / HTML 5 canvas capable browser.
Temperature (K) | A | B | C | Reference | Comment |
---|---|---|---|---|---|
273.16 to 348.16 | 3.53918 | 927.108 | -98.949 | Neely and Hall, 1972 | Coefficents calculated by NIST from author's data. |

Henry's Law data

Data compiled by: Rolf Sander
Henry's Law constant (water solution)
kH(T) = k°H exp(d(ln(kH))/d(1/T) ((1/T) - 1/(298.15 K)))
k°H = Henry's law constant for solubility in water at 298.15 K (mol/(kg*bar))
d(ln(kH))/d(1/T) = Temperature dependence constant (K)
k°H (mol/(kg*bar)) | d(ln(kH))/d(1/T) (K) | Method | Reference | Comment |
---|---|---|---|---|
74. | 5700. | M | N/A | |
57. | M | N/A | ||
190. | X | N/A | Value given here as quoted by missing citation. |

Gas phase ion energetics data

Data evaluated as indicated in comments:
HL - Edward P. Hunter and Sharon G. Lias
Data compiled as indicated in comments:
LBLHLM - Sharon G. Lias, John E. Bartmess, Joel F. Liebman, John L. Holmes, Rhoda D. Levin, and W. Gary Mallard
LLK - Sharon G. Lias, Rhoda D. Levin, and Sherif A. Kafafi
RDSH - Henry M. Rosenstock, Keith Draxl, Bruce W. Steiner, and John T. Herron
B - John E. Bartmess
Quantity | Value | Units | Method | Reference | Comment |
---|---|---|---|---|---|
Proton affinity (review) | 801.9 | kJ/mol | N/A | Hunter and Lias, 1998 | HL |
Quantity | Value | Units | Method | Reference | Comment |
Gas basicity | 770.1 | kJ/mol | N/A | Hunter and Lias, 1998 | HL |
Electron affinity determinations
EA (eV) | Method | Reference | Comment |
---|---|---|---|
0.69 ± 0.10 | TDEq | Kebarle and Chowdhury, 1987 | B |
1.10002 | ES | Compton, Christophorou, et al., 1966 | B |
Ionization energy determinations
IE (eV) | Method | Reference | Comment |
---|---|---|---|
9.30 | PI | Traeger, McLouglin, et al., 1982 | LBLHLM |
9.23 ± 0.03 | PI | Watanabe, Nakayama, et al., 1962 | RDSH |
9.25 ± 0.03 | PI | Watanabe, 1957 | RDSH |
9.57 ± 0.05 | PE | Verheijdt and Cerfontain, 1982 | Vertical value; LBLHLM |
9.56 | PE | Kimura, Katsumata, et al., 1981 | Vertical value; LLK |
9.6 | PE | Von Niessen, Bieri, et al., 1980 | Vertical value; LLK |
9.47 | PE | Kobayashi, 1978 | Vertical value; LLK |
9.55 | PE | McGlynn and Meeks, 1975 | Vertical value; LLK |
9.57 | PE | Kelder, Cerfontain, et al., 1974 | Vertical value; LLK |
9.72 | PE | Arnett, Newkome, et al., 1974 | Vertical value; LLK |
9.55 | PE | Cowan, Gleiter, et al., 1971 | Vertical value; LLK |
Appearance energy determinations
Ion | AE (eV) | Other Products | Method | Reference | Comment |
---|---|---|---|---|---|
CH3+ | 14.1 | C2H3O+CO | EI | Burgers, Holmes, et al., 1983 | LBLHLM |
C2H3O+ | 10.0 ± 0.1 | CH3CO | EI | Burgers, Holmes, et al., 1983 | LBLHLM |
C2H3O+ | 9.88 | C2H3O | PI | Traeger, McLouglin, et al., 1982 | LBLHLM |
C2H3O+ | 9.88 | CH3CO | PI | Murad and Inghram, 1964 | RDSH |
C2H3CO+ | 9.88 ± 0.19 | CH3CO | EI | Holmes and Lossing, 1984 | LBLHLM |

Kovats' RI, non-polar column, isothermal

Column type | Active phase | Temperature (C) | I | Reference | Comment |
---|---|---|---|---|---|
Capillary | SE-30 | 100. | 572.0 | Tudor, 1997 | 40. m/0.35 mm/0.35 μm |
Packed | SE-30 | 150. | 555. | Haken, Ho, et al., 1975 | Column length: 3.7 m |
Packed | DC-200 | 120. | 550. | Reymond, Mueggler-Chavan, et al., 1966 | Celite; Column length: 4. m |
Packed | SE-30 | 80. | 565. | Viani, Müggler-Chavan, et al., 1965 | He, Chromosorb P; Column length: 6. m |

Kovats' RI, non-polar column, temperature ramp

Column type | Active phase | I | Reference | Comment |
---|---|---|---|---|
Capillary | DB-1 | 558. | Takeoka, Flath, et al., 1990 | 60. m/0.32 mm/0.25 μm, He, 30. C @ 4. min, 2. K/min; Tend: 210. C |
Capillary | DB-1 | 560. | Takeoka, Flath, et al., 1990 | 60. m/0.32 mm/0.25 μm, He, 30. C @ 4. min, 2. K/min; Tend: 210. C |
Capillary | OV-101 | 613. | Shibamoto, Kamiya, et al., 1981 | N2, 1. K/min; Column length: 80. m; Column diameter: 0.28 mm; Tstart: 80. C; Tend: 200. C |
Capillary | OV-101 | 619. | Shibamoto, Kamiya, et al., 1981 | N2, 1. K/min; Column length: 80. m; Column diameter: 0.28 mm; Tstart: 80. C; Tend: 200. C |

Kovats' RI, polar column, temperature ramp

Column type | Active phase | I | Reference | Comment |
---|---|---|---|---|
Capillary | DB-Wax | 971. | Shimoda and Shibamoto, 1990 | He, 40. C @ 6. min, 3. K/min; Column length: 60. m; Column diameter: 0.25 mm; Tend: 190. C |
Capillary | DB-Wax | 977. | Tatsuka, Suekane, et al., 1990 | 60. m/0.25 mm/0.25 μm, He, 40. C @ 5. min, 3. K/min; Tend: 200. C |
Capillary | DB-Wax | 978. | Tatsuka, Suekane, et al., 1990 | 60. m/0.25 mm/0.25 μm, He, 40. C @ 5. min, 3. K/min; Tend: 200. C |
Capillary | Carbowax 20M | 961. | Nishimura, Yamaguchi, et al., 1989 | 2. K/min; Column length: 50. m; Column diameter: 0.22 mm; Tstart: 80. C; Tend: 200. C |
Capillary | DB-Wax | 980. | Umano, Shoji, et al., 1986 | N2, 60. C @ 10. min, 2. K/min; Column length: 30. m; Column diameter: 0.25 mm; Tend: 200. C |
Packed | PEG-20M | 963. | Galt and MacLeod, 1984 | N2, Celite, 70. C @ 9. min, 10. K/min; Column length: 5.5 m; Tend: 175. C |
Capillary | BP-20 | 963. | MacLeod and Pieris, 1983 | H2, 65. C @ 3. min, 12. K/min; Column length: 25. m; Column diameter: 0.20 mm; Tend: 180. C |
Capillary | Carbowax 20M | 949. | Shibamoto, Kamiya, et al., 1981 | N2, 2. K/min; Column length: 50. m; Column diameter: 0.28 mm; Tstart: 80. C; Tend: 200. C |
Capillary | Carbowax 20M | 955. | Shibamoto, Kamiya, et al., 1981 | N2, 2. K/min; Column length: 50. m; Column diameter: 0.28 mm; Tstart: 80. C; Tend: 200. C |

Kovats' RI, polar column, custom temperature program

Column type | Active phase | I | Reference | Comment |
---|---|---|---|---|
Capillary | Carbowax 20M | 979. | Brander, Kepner, et al., 1980 | Program: not specified |
Capillary | Carbowax 20M | 984. | Brander, Kepner, et al., 1980 | Program: not specified |

Van Den Dool and Kratz RI, non-polar column, temperature ramp

Column type | Active phase | I | Reference | Comment |
---|---|---|---|---|
Capillary | SPB-5 | 587. | Engel and Ratel, 2007 | 60. m/0.32 mm/1. μm, 40. C @ 2. min, 3. K/min, 230. C @ 10. min |
Capillary | DB-5MS | 600. | Lozano P.R., Drake M., et al., 2007 | 30. m/0.25 mm/0.25 μm, He, 35. C @ 5. min, 10. K/min, 225. C @ 25. min |
Capillary | DB-5MS | 579. | Lozano P.R., Miracle E.R., et al., 2007 | 30. m/0.25 mm/0.25 μm, He, 35. C @ 5. min, 10. K/min, 225. C @ 25. min |
Capillary | CP-Sil 8CB-MS | 600. | Elmore, Cooper, et al., 2005 | 0. m/0.25 mm/0.25 μm, He, 40. C @ 2. min, 4. K/min, 280. C @ 5. min |
Capillary | HP-5 | 593. | Insausti, Goñi, et al., 2005 | 50. m/0.32 mm/1.05 μm, He, 35. C @ 15. min, 8. K/min, 220. C @ 5. min |
Capillary | HP-5 | 605. | Mahattanatawee, Goodner, et al., 2005 | 30. m/0.25 mm/0.25 μm, He, 50. C @ 5. min, 4. K/min, 250. C @ 15. min |
Capillary | HP-5 | 608. | Mahattanatawee, Goodner, et al., 2005 | 30. m/0.25 mm/0.25 μm, He, 50. C @ 5. min, 4. K/min, 250. C @ 15. min |
Capillary | DB-5 | 623. | Avsar, Karagul-Yuceer, et al., 2004 | 30. m/0.25 mm/0.25 μm, 40. C @ 5. min, 10. K/min, 200. C @ 15. min |
Capillary | DB-5 | 623. | Avsar, Karagul-Yuceer, et al., 2004 | 30. m/0.25 mm/0.25 μm, 40. C @ 5. min, 10. K/min, 200. C @ 15. min |
Capillary | CP-Sil 8CB-MS | 587. | Hierro, de la Hoz, et al., 2004 | 60. m/0.25 mm/0.25 μm, 40. C @ 2. min, 4. K/min, 280. C @ 5. min |
Capillary | DB-5 | 606. | Mahajan, Goddik, et al., 2004 | 30. m/0.32 mm/1. μm, He, 40. C @ 4. min, 5. K/min, 230. C @ 10. min |
Capillary | SPB-5 | 612. | Pino, Marbot, et al., 2004 | 30. m/0.25 mm/0.25 μm, He, 60. C @ 2. min, 4. K/min, 250. C @ 20. min |
Capillary | SPB-5 | 612. | Pino, Marbot, et al., 2004, 2 | 30. m/0.25 mm/0.25 μm, He, 60. C @ 2. min, 4. K/min, 250. C @ 20. min |
Capillary | HP-5 | 586. | Siegmund and Murkovic, 2004 | 30. m/0.25 mm/0.1 μm, -30. C @ 1. min, 10. K/min, 250. C @ 5. min |
Capillary | DB-5 | 574. | Peterson and Reineccius, 2003 | 30. m/0.25 mm/0.25 μm, 35. C @ 2. min, 4. K/min, 250. C @ 4. min |
Capillary | DB-5 | 574. | Peterson and Reineccius, 2003, 2 | 30. m/0.25 mm/0.25 μm, 35. C @ 2. min, 4. K/min, 250. C @ 4. min |
Capillary | SPB-5 | 612. | Pino, Marbot, et al., 2003 | 30. m/0.25 mm/0.25 μm, He, 60. C @ 2. min, 4. K/min, 250. C @ 20. min |
Capillary | CP Sil 8 CB | 616. | Duckham, Dodson, et al., 2002 | 60. m/0.25 mm/0.25 μm, He, 40. C @ 8. min, 4. K/min, 250. C @ 10. min |
Capillary | DB-5 | 621. | Karagül-Yüceer, Cadwallader, et al., 2002 | 30. m/0.32 mm/0.25 μm, 35. C @ 5. min, 10. K/min, 200. C @ 30. min |
Capillary | SPB-5 | 612. | Pino, Marbot, et al., 2002 | 30. m/0.25 mm/0.25 μm, He, 60. C @ 2. min, 4. K/min, 250. C @ 20. min |
Capillary | DB-5 | 608. | Wu and Cadwallader, 2002 | 30. m/0.32 mm/0.25 μm, He, 40. C @ 5. min, 10. K/min, 220. C @ 30. min |
Capillary | DB-5 | 608. | Wu and Cadwallader, 2002 | 30. m/0.32 mm/0.25 μm, He, 40. C @ 5. min, 10. K/min, 220. C @ 30. min |
Capillary | DB-5 | 582. | Zhou, Wintersteen, et al., 2002 | 15. m/0.32 mm/0.5 μm, 30. C @ 2. min, 10. K/min, 225. C @ 20. min |
Capillary | DB-5MS | 613. | Baek, Kim, et al., 2001 | 60. m/0.25 mm/0.25 μm, He, 40. C @ 5. min, 3. K/min, 200. C @ 60. min |
Capillary | CP-Sil 8CB-MS | 612. | Bruna, Hierro, et al., 2001 | 60. m/0.25 mm/0.25 μm, 40. C @ 2. min, 4. K/min; Tend: 280. C |
Capillary | SPB-1 | 558. | Larráyoz, Addis, et al., 2001 | 30. m/0.32 mm/4. μm, He, 45. C @ 13. min, 5. K/min, 240. C @ 5. min |
Capillary | DB-5MS | 606. | Lee, Suriyaphan, et al., 2001 | 60. m/0.25 mm/0.25 μm, He, 40. C @ 5. min, 2. K/min, 200. C @ 30. min |
Capillary | CP Sil 8 CB | 595. | Elmore, Mottram, et al., 2000 | 60. m/0.25 mm/0.25 μm, He, 40. C @ 2. min, 4. K/min; Tend: 280. C |
Capillary | CP Sil 8 CB | 618. | Chevance and Farmer, 1999 | 60. C @ 5. min, 4. K/min, 220. C @ 30. min; Column length: 50. m; Column diameter: 0.32 mm |
Capillary | BPX-5 | 613. | Aaslyng, Elmore, et al., 1998 | 50. m/0.32 mm/0.50 μm, He, 4. K/min; Tstart: 40. C; Tend: 280. C |
Capillary | SPB-5 | 588. | Verdier-Metz., Coulon, et al., 1998 | 60. m/0.32 mm/1. μm, He, 40. C @ 5. min, 3. K/min, 200. C @ 2. min |
Capillary | RTX-5 | 595. | Milo and Reineccius, 1997 | 30. m/0.53 mm/1.5 μm, 0. C @ 1. min, 8. K/min; Tend: 250. C |
Capillary | OV-101 | 560. | Misharina, Golovnya, et al., 1992 | 50. m/0.31 mm/0.5 μm, He, 4. K/min; Tstart: 50. C; Tend: 250. C |
Capillary | HP-1 | 604. | Zhang, Dorjpalam, et al., 1992 | 50. m/0.32 mm/1.5 μm, 2. K/min, 220. C @ 30. min; Tstart: 40. C |
Capillary | OV-101 | 586. | Misharina, Aerove, et al., 1991 | 50. m/0.32 mm/0.50 μm, He, 2. K/min; Tstart: 50. C; Tend: 250. C |
Capillary | DB-1 | 561. | Zhang and Ho, 1991 | 60. m/0.25 mm/0.25 μm, He, 2. K/min, 220. C @ 10. min; Tstart: 40. C |
Capillary | DB-1 | 561. | Zhang and Ho, 1991, 2 | 60. m/0.25 mm/0.25 μm, He, 2. K/min, 220. C @ 10. min; Tstart: 40. C |

Van Den Dool and Kratz RI, non-polar column, custom temperature program

Column type | Active phase | I | Reference | Comment |
---|---|---|---|---|
Capillary | SPB-5 | 593. | Majcher and Jelen, 2007 | 30. m/0.53 mm/1.5 μm; Program: 40C(1min) => 6C/min => 180C => 20C/min => 280C |
Capillary | HP-5 | 586. | Künzel, Breuer, et al., 2006 | Program: not specified |
Capillary | SE-54 | 587. | Schuh and Schieberle, 2006 | 30. m/0.32 mm/0.25 μm; Program: 40C(2min) => 6C/min => 150C => 20C/min => 230C |
Capillary | DB-5MS | 600. | Varlet V., Knockaert C., et al., 2006 | 30. m/0.32 mm/0.5 μm, He; Program: 70C(1min) => 3C/min => 80C(1min) => 5C/min => 150C => 10C/min => 280C (4min) |
Capillary | DB-5MS | 600. | Varlet V., Knockaert C., et al., 2006 | 30. m/0.32 mm/0.5 μm, He; Program: 70C(1min) => 3C/min => 80C(1min) => 5C/min => 150C => 10C/min => 280C (4min) |
Capillary | HP-5MS | 596. | Bonaiti, Irlinger, et al., 2005 | 30. m/0.25 mm/0.25 μm, He; Program: 5C(8min) => 3C/min => 20C => 10C/min => 150C(10min) |
Capillary | DB-5 | 593. | Majcher and Jelén, 2005 | 30. m/0.25 mm/0.25 μm, He; Program: 40C(1min) => 6C/min => 180C => 20C/min => 280C |
Capillary | DB-5 | 544. | Klesk, Qian, et al., 2004 | 30. m/0.32 mm/1. μm, He; Program: 40C (2min) => 5C/min => 100C => 4C/min => 230C (10min) |
Capillary | DB-5 | 579. | Klesk and Qian, 2003 | 30. m/0.25 mm/0.25 μm, He; Program: 40C(2min) => 5C/min => 100C => 4C/min => 230C(10min) |
Capillary | DB-5 | 584. | Klesk and Qian, 2003, 2 | 30. m/0.32 mm/1. μm, He; Program: 40C(2min) => 2C/min => 100C => 10C/min => 230C (5min) |
Capillary | DB-5 | 583. | Mayr, van Ruth, et al., 2003 | 60. m/0.32 mm/1. μm, He; Program: 40 C(4min) => 2C/min => 90C => 4C/min => 130C => 8C/min => 250C |
Capillary | DB-1 | 558. | Place, Imhof, et al., 2003 | 60. m/0.32 mm/1. μm, He; Program: 35C(5min) => 10C/min => 45C (5min) => 5C/min => 250C (10min) |
Capillary | HP-5 | 590. | Carrapiso, Ventanas, et al., 2002 | 50. m/0.32 mm/1.05 μm; Program: 35C(5min) => 10C/min => 150C => 20C/min => 250C(10 min) |
Capillary | HP-5 | 595. | Engel, Baty, et al., 2002 | 30. m/0.25 mm/0.25 μm, He; Program: 5C(5min) => 3C/min => 20C => 5C/min => 100C 15C/min => 150C (5min) |
Capillary | DB-5 | 595. | Zehentbauer and Reineccius, 2002 | 30. m/0.25 mm/0.25 μm, He; Program: 35 C (2 min) 40 C/min -> 50 C (2 min) 4 C/min -> 230 C |
Capillary | DB-5 | 593. | Zehentbauer and Reineccius, 2002 | 30. m/0.25 mm/0.25 μm, He; Program: 35 C (2 min) 40 C/min -> 50 C (2 min) 4 C/min -> 230 C |
Capillary | CP Sil 8 CB | 611. | Duckham, Dodson, et al., 2001 | 60. m/0.25 mm/0.25 μm; Program: 0C => rapidly => 40C(8min) => 4C/min => 250C(10min) |
Capillary | SE-54 | 596. | Tairu, Hofmann, et al., 2000 | 30. m/0.32 mm/0.25 μm, He; Program: 35C (2min) => 40C/min => 60C (2min) => 6C/min => 180C (5min) => 10C/min => 230C (5min) |
Capillary | SE-54 | 600. | Zimmermann and Schieberle, 2000 | 30. m/0.25 mm/0.25 μm, He; Program: 35C(2min) => 40C/min => 60C => 6C/min => 180C 20C/min => 240C(10min) |
Capillary | SE-54 | 600. | Buettner and Schieberle, 1999 | 30. m/0.32 mm/0.25 μm, He; Program: 35C (2min) => 40C/min => 50C (2min) => 6C/min => 180C => 10C/min => 230C (10min) |
Capillary | SE-54 | 592. | Mutti and Grosch, 1999 | 60. m/0.32 mm/0.25 μm, He; Program: 40C(2min) => 5C/min => 70C(2min) => 6C/min => 250C(10min) |
Capillary | RTX-5 | 565. | Mutti and Grosch, 1999 | Program: not specified |
Capillary | SE-54 | 608. | Fickert and Schieberle, 1998 | 25. m/0.32 mm/0.5 μm, He; Program: 35C (2min) => 4C/min => 150C => 10C/min => 240C |
Capillary | SE-54 | 590. | Fickert and Schieberle, 1998 | 25. m/0.32 mm/0.5 μm, He; Program: 35C (2min) => 4C/min => 150C => 10C/min => 240C |
Capillary | SE-54 | 592. | Hofmann and Schieberle, 1998 | 30. m/0.32 mm/0.25 μm, He; Program: 40C(2min) => 40C/min => 50C(5min) => 6C/min => 230(15min) |
Capillary | RTX-5 | 595. | Heiler and Schieberle, 1997 | 30. m/0.53 mm/1. μm; Program: not specified |
Capillary | SE-54 | 595. | Kubícková and Grosch, 1997 | Column length: 30. m; Column diameter: 0.32 mm; Program: 35C (2min) => 40C/min => 50C (2min) => 4C/min => 250C (10min) |
Capillary | SE-54 | 592. | Kubícková and Grosch, 1997 | Column length: 30. m; Column diameter: 0.32 mm; Program: 35C (2min) => 40C/min => 50C (2min) => 4C/min => 250C (10min) |
Capillary | DB-5MS | 595. | Milo and Reineccius, 1997 | 30. m/0.25 mm/0.5 μm; Program: 40C(2min) => 6C/min => 180C => 10C/min => 250C |
Capillary | SE-54 | 592. | Münch, Hofmann, et al., 1997 | 30. m/0.32 mm/0.25 μm, He; Program: 40C (2min) => 40C/min => 50C (2min) => 240C (10min) |
Capillary | SE-54 | 595. | Triqui and Reineccius, 1995 | Program: 35C (2min) => 40C/min => 50C (1min) => 6C/min => 250C (10min) |
Capillary | SE-54 | 595. | Triqui and Reineccius, 1995, 2 | 30. m/0.32 mm/0.3 μm, He; Program: 35C (2min) => 40 C/min => 50C (1min) => 6C/min => 250C |
Capillary | HP-PONA | 558. | Maignial, Pibarot, et al., 1992 | 50. m/0.2 mm/0.5 μm; Program: 20C(0.5min) => fast => 60C => 4C/min => 250C |

Van Den Dool and Kratz RI, polar column, temperature ramp

Column type | Active phase | I | Reference | Comment |
---|---|---|---|---|
Capillary | FFAP | 1005. | Lozano P.R., Drake M., et al., 2007 | 30. m/0.25 mm/0.25 μm, He, 35. C @ 5. min, 10. K/min, 225. C @ 25. min |
Capillary | FFAP | 982. | Lozano P.R., Drake M., et al., 2007 | 30. m/0.25 mm/0.25 μm, He, 35. C @ 5. min, 10. K/min, 225. C @ 25. min |
Capillary | FFAP | 991. | Lozano P.R., Miracle E.R., et al., 2007 | 30. m/0.25 mm/0.25 μm, He, 35. C @ 5. min, 10. K/min, 225. C @ 25. min |
Capillary | DB-Wax | 962. | Pozo-Bayon M.A., Ruiz-Rodriguez A., et al., 2007 | 30. m/0.25 mm/0.5 μm, He, 40. C @ 5. min, 4. K/min, 250. C @ 15. min |
Capillary | DB-Wax | 978. | Pozo-Bayon M.A., Ruiz-Rodriguez A., et al., 2007 | 30. m/0.25 mm/0.5 μm, He, 40. C @ 5. min, 4. K/min, 250. C @ 15. min |
Capillary | DB-Wax | 962. | Pozo-Bayon M.A., Ruiz-Rodriguez A., et al., 2007 | 30. m/0.25 mm/0.5 μm, He, 40. C @ 5. min, 4. K/min, 250. C @ 15. min |
Capillary | DB-Wax | 970. | Gurbuz O., Rouseff J.M., et al., 2006 | 60. m/0.25 mm/0.25 μm, He, 7. K/min, 265. C @ 5. min; Tstart: 40. C |
Capillary | DB-Wax | 977. | Gurbuz O., Rouseff J.M., et al., 2006 | 30. m/0.32 mm/0.5 μm, He, 7. K/min, 265. C @ 5. min; Tstart: 40. C |
Capillary | DB-Wax | 1020. | Lopez-Galilea I., Fournier N., et al., 2006 | 30. m/0.32 mm/0.5 μm, He, 5. K/min, 240. C @ 10. min; Tstart: 40. C |
Capillary | CP-Wax 52CB | 971. | Mahadevan and Farmer, 2006 | 60. C @ 5. min, 4. K/min, 220. C @ 30. min; Column length: 50. m; Column diameter: 0.32 mm |
Capillary | DB-Wax | 1002. | Petka, Ferreira, et al., 2006 | 30. m/0.32 mm/0.5 μm, 40. C @ 3. min, 5. K/min, 200. C @ 8. min |
Capillary | DB-Wax | 998. | Whetstine M.E.C., Drake M.A., et al., 2006 | 30. m/0.25 mm/0.25 μm, He, 40. C @ 3. min, 10. K/min, 200. C @ 20. min |
Capillary | CP-Wax 52CB | 976. | Alasalvar, Taylor, et al., 2005 | 60. m/0.25 mm/0.25 μm, 35. C @ 4. min, 3. K/min; Tend: 203. C |
Capillary | DB-Wax | 955. | Carunchia Whetstine, Croissant, et al., 2005 | 30. m/0.25 mm/0.25 μm, 40. C @ 3. min, 10. K/min, 200. C @ 20. min |
Capillary | Stabilwax | 983. | Cros S., Lignot B., et al., 2005 | 60. m/0.25 mm/0.25 μm, He, 40. C @ 5. min, 3. K/min, 240. C @ 10. min |
Capillary | Supelcowax-10 | 978. | Elmore, Nisyrios, et al., 2005 | 60. m/0.25 mm/0.25 μm, He, 40. C @ 2. min, 4. K/min; Tend: 280. C |
Capillary | DB-Wax | 1014. | Malliaa, Fernandez-Garcia, et al., 2005 | 60. m/0.32 mm/1. μm, He, 45. C @ 1. min, 5. K/min, 250. C @ 12. min |
Capillary | DB-Wax | 999. | Malliaa, Fernandez-Garcia, et al., 2005 | 60. m/0.32 mm/1. μm, He, 45. C @ 1. min, 5. K/min, 250. C @ 12. min |
Capillary | DB-Wax | 956. | Whetstine, Cadwallader, et al., 2005 | 30. m/0.25 mm/0.25 μm, 40. C @ 3. min, 10. K/min, 200. C @ 20. min |
Capillary | DB-FFAP | 980. | Avsar, Karagul-Yuceer, et al., 2004 | 15. m/0.32 mm/0.25 μm, He, 35. C @ 5. min, 10. K/min, 225. C @ 15. min |
Capillary | DB-Wax | 979. | Avsar, Karagul-Yuceer, et al., 2004 | 30. m/0.25 mm/0.25 μm, 40. C @ 5. min, 10. K/min, 200. C @ 15. min |
Capillary | DB-Wax | 979. | Avsar, Karagul-Yuceer, et al., 2004 | 30. m/0.25 mm/0.25 μm, 40. C @ 5. min, 10. K/min, 200. C @ 15. min |
Capillary | DB-FFAP | 980. | Avsar, Karagul-Yuceer, et al., 2004 | 15. m/0.32 mm/0.25 μm, He, 35. C @ 5. min, 10. K/min, 225. C @ 15. min |
Capillary | DB-Wax | 1005. | Mahajan, Goddik, et al., 2004 | 30. m/0.25 mm/0.5 μm, He, 40. C @ 2. min, 5. K/min, 230. C @ 10. min |
Capillary | DB-Wax | 965. | Varming, Petersen, et al., 2004 | 30. m/0.25 mm/0.25 μm, He, 40. C @ 10. min, 6. K/min, 240. C @ 25. min |
Capillary | DB-Wax | 979. | Peterson and Reineccius, 2003 | 30. m/0.25 mm/0.25 μm, 35. C @ 2. min, 6. K/min, 240. C @ 6. min |
Capillary | AT-Wax | 940. | Pino, Almora, et al., 2003 | 60. m/0.32 mm/0.25 μm, He, 65. C @ 10. min, 2. K/min, 250. C @ 60. min |
Capillary | DB-Wax | 970. | Karagül-Yüceer, Cadwallader, et al., 2002 | 30. m/0.25 mm/0.25 μm, 35. C @ 5. min, 10. K/min, 200. C @ 30. min |
Capillary | DB-Wax | 956. | Kim T.H., Kim T.H., et al., 2002 | 30. m/0.25 mm/0.25 μm, He, 40. C @ 5. min, 3. K/min, 200. C @ 20. min |
Capillary | DB-Wax | 959. | Kim T.H., Kim T.H., et al., 2002 | 30. m/0.25 mm/0.25 μm, He, 40. C @ 5. min, 3. K/min, 200. C @ 20. min |
Capillary | AT-Wax | 951. | Pino, Marbot, et al., 2002, 2 | 60. m/0.32 mm/0.25 μm, He, 65. C @ 10. min, 2. K/min, 250. C @ 60. min |
Capillary | DB-Wax | 980. | Wu and Cadwallader, 2002 | 30. m/0.32 mm/1. μm, He, 40. C @ 5. min, 10. K/min, 200. C @ 30. min |
Capillary | DB-Wax | 981. | Wu and Cadwallader, 2002 | 30. m/0.53 mm/1. μm, He, 40. C @ 5. min, 10. K/min, 200. C @ 30. min |
Capillary | DB-FFAP | 985. | Zhou, Wintersteen, et al., 2002 | 15. m/0.32 mm/0.25 μm, 30. C @ 2. min, 10. K/min, 225. C @ 20. min |
Capillary | DB-FFAP | 980. | Zhou, Wintersteen, et al., 2002 | 15. m/0.32 mm/0.25 μm, 30. C @ 2. min, 10. K/min, 225. C @ 20. min |
Capillary | EC-WAX | 980. | le Guen, Prost, et al., 2001 | 30. m/0.32 mm/0.5 μm, He, 40. C @ 2. min, 5. K/min, 250. C @ 10. min |
Capillary | DB-Wax | 960. | Kim, Shin, et al., 2001 | 30. m/0.25 mm/0.25 μm, He, 40. C @ 5. min, 2. K/min, 200. C @ 20. min |
Capillary | DB-Wax | 956. | Kim, Shin, et al., 2001 | 30. m/0.25 mm/0.25 μm, He, 40. C @ 5. min, 2. K/min, 200. C @ 20. min |
Capillary | DB-Wax | 981. | Lee, Suriyaphan, et al., 2001 | 60. m/0.25 mm/0.25 μm, He, 2. K/min; Tstart: 40. C; Tend: 200. C |
Capillary | DB-Wax | 981. | Lee, Suriyaphan, et al., 2001 | 60. m/0.25 mm/0.25 μm, He, 2. K/min; Tstart: 40. C; Tend: 200. C |
Capillary | CP-Wax 52CB | 1002. | Liu, Yang, et al., 2001 | H2, 2. K/min; Column length: 50. m; Column diameter: 0.32 mm; Tstart: 50. C; Tend: 200. C |
Capillary | AT-Wax | 951. | Pino and Marbot, 2001 | 60. m/0.32 mm/0.25 μm, He, 65. C @ 10. min, 2. K/min, 250. C @ 60. min |
Capillary | DB-Wax | 983. | Serot, Prost, et al., 2001 | 30. m/0.32 mm/0.5 μm, He, 8. K/min; Tstart: 50. C; Tend: 250. C |
Capillary | DB-Wax | 980. | le Guen, Prost, et al., 2000 | 60. m/0.32 mm/0.5 μm, He, 40. C @ 5. min, 3. K/min, 250. C @ 10. min |
Capillary | DB-Wax | 985. | Le Guen, Prost, et al., 2000 | 60. m/0.32 mm/0.5 μm, He, 40. C @ 2. min, 4. K/min, 250. C @ 10. min |
Capillary | DB-Wax | 980. | Le Guen, Prost, et al., 2000 | 60. m/0.32 mm/0.5 μm, He, 40. C @ 2. min, 4. K/min, 250. C @ 10. min |
Capillary | CP-Wax 52CB | 982. | Chevance and Farmer, 1999 | 60. C @ 5. min, 4. K/min, 220. C @ 30. min; Column length: 50. m; Column diameter: 0.32 mm |
Capillary | CP-Wax 52CB | 982. | Chevance and Farmer, 1999, 2 | 40. C @ 5. min, 4. K/min, 220. C @ 30. min; Column length: 50. m; Column diameter: 0.32 mm |
Capillary | FFAP | 987. | Stephan and Steinhart, 1999 | 60. m/0.25 mm/0.5 μm, 50. C @ 3. min, 5. K/min, 230. C @ 15. min |
Capillary | DB-Wax | 958. | Cha and Cadwallader, 1998 | 30. m/0.32 mm/0.25 μm, 40. C @ 5. min, 6. K/min, 200. C @ 30. min |
Capillary | DB-Wax | 965. | Cha, Kim, et al., 1998 | 60. m/0.25 mm/0.25 μm, 40. C @ 5. min, 3. K/min, 200. C @ 60. min |
Capillary | DB-Wax | 963. | Cha, Kim, et al., 1998 | 30. m/0.32 mm/0.25 μm, He, 40. C @ 5. min, 6. K/min, 200. C @ 30. min |
Capillary | FFAP | 993. | Ott, Fay, et al., 1997 | 30. m/0.25 mm/0.25 μm, He, 20. C @ 1. min, 4. K/min, 200. C @ 1. min |
Capillary | DB-Wax | 993. | Ott, Fay, et al., 1997 | 60. m/0.53 mm/1. μm, He, 20. C @ 5. min, 4. K/min, 200. C @ 10. min |
Capillary | DB-Wax | 995. | Ott, Fay, et al., 1997 | 60. m/0.53 mm/1. μm, He, 20. C @ 5. min, 4. K/min, 200. C @ 10. min |
Capillary | DB-Wax | 995. | Ott, Fay, et al., 1997 | 60. m/0.53 mm/1. μm, He, 20. C @ 5. min, 4. K/min, 200. C @ 10. min |
Capillary | Supelcowax-10 | 981. | Cadwallader, Tan, et al., 1995 | 60. m/0.25 mm/0.25 μm, He, 40. C @ 5. min, 2. K/min, 200. C @ 30. min |
Capillary | DB-Wax | 955. | Shimoda, Shigematsu, et al., 1995 | 60. m/0.25 mm/0.25 μm, 2. K/min; Tstart: 50. C; Tend: 230. C |
Capillary | DB-Wax | 993. | Shiratsuchi, Shimoda, et al., 1994 | 60. m/0.25 mm/0.25 μm, He, 2. K/min, 230. C @ 60. min; Tstart: 50. C |
Capillary | Supelcowax-10 | 979. | Chung and Cadwallader, 1993 | 60. m/0.25 mm/0.25 μm, He, 40. C @ 5. min, 2. K/min, 195. C @ 40. min |
Capillary | Supelcowax-10 | 983. | Tanchotikul and Hsieh, 1989 | 60. m/0.25 mm/0.25 μm, 40. C @ 5. min, 2. K/min, 175. C @ 20. min |
Capillary | Supelcowax-10 | 985. | Tanchotikul and Hsieh, 1989 | 60. m/0.25 mm/0.25 μm, 40. C @ 5. min, 2. K/min, 175. C @ 20. min |
Capillary | CP-WAX 57CB | 957. | Baltes and Mevissen, 1988 | He, 50. C @ 5. min, 2. K/min; Column length: 50. m; Column diameter: 0.24 mm; Tend: 210. C |
Capillary | Supelcowax-10 | 982. | Vejaphan, Hsieh, et al., 1988 | 60. m/0.25 mm/0.25 μm, 40. C @ 5. min, 2. K/min, 175. C @ 20. min |
Capillary | Supelcowax-10 | 983. | Vejaphan, Hsieh, et al., 1988 | 60. m/0.25 mm/0.25 μm, 40. C @ 5. min, 2. K/min, 175. C @ 20. min |
Packed | Carbowax 20M | 956. | van den Dool and Kratz, 1963 | Celite 545, 4.6 K/min; Tstart: 75. C; Tend: 228. C |

Van Den Dool and Kratz RI, polar column, custom temperature program

Column type | Active phase | I | Reference | Comment |
---|---|---|---|---|
Capillary | Supelcowax-10 | 989. | Bianchi, Cantoni, et al., 2007 | 30. m/0.25 mm/0.25 μm; Program: 35C(8min) => 4C/min => 60C => 6C/min => 160C => 20C/min => 220C(1min) |
Capillary | Supelcowax-10 | 986. | Bianchi, Careri, et al., 2007 | 30. m/0.25 mm/0.25 μm, He; Program: 35C(8min) => 4C/min => 60C => 6C/min => 160C => 20C/min => 200C(1min) |
Capillary | Supelcowax-10 | 988. | Bianchi, Careri, et al., 2007 | 30. m/0.25 mm/0.25 μm, He; Program: 35C(8min) => 4C/min => 60C => 6C/min => 160C => 20C/min => 200C(1min) |
Capillary | Supelcowax-10 | 989. | Bianchi, Careri, et al., 2007 | 30. m/0.25 mm/0.25 μm, He; Program: 35C(8min) => 4C/min => 60C => 6C/min => 160C => 20C/min => 200C(1min) |
Capillary | DB-Wax | 1012. | Escudero, Campo, et al., 2007 | 30. m/0.32 mm/0.5 μm, H2; Program: 40C(5min) => 4C/min => 100C6C/min => 136C => 3C/min => 220C (10min) |
Capillary | Supelcowax-10 | 986. | Majcher and Jelen, 2007 | 30. m/0.25 mm/0.25 μm; Program: 40C(2min) => 40C/min => 60C(2min) => 5C/min => 240C |
Capillary | FFAP | 967. | Schuh and Schieberle, 2006 | 30. m/0.32 mm/0.25 μm; Program: 40C(2min) => 6C/min => 150C => 20C/min => 230C |
Capillary | DB-Wax | 1012. | Campo, Ferreira, et al., 2005 | 30. m/0.32 mm/0.5 μm, H2; Program: 40C(5min) => 4C/min => 100C => 6C/min => 200C |
Capillary | DB-Wax | 947. | Hallier, Prost, et al., 2005 | 30. m/0.32 mm/0.5 μm, He; Program: 40C(5min) => 10C/min => 160C => 15C/min => 230C |
Capillary | FFAP | 982. | Ranau, Kleeberg, et al., 2005 | 60. m/0.25 mm/0.5 μm, He; Program: 50C(3min) => 3C/min => 100C => 10C/min => 220C(13.5min) |
Capillary | FFAP | 982. | Ranau and Steinhart, 2005 | 60. m/0.25 mm/0.5 μm, He; Program: 50C(3min) => 3C/min => 100C => 10C/min => 220C (13.5min) |
Capillary | Stabilwax | 976. | Wang, Finn, et al., 2005 | 30. m/0.32 mm/1. μm, He; Program: 40C(2min) => 5C/min => 100C => 4C/min => 230C (10min) |
Capillary | DB-Wax | 943. | Ferrari, Lablanquie, et al., 2004 | 60. m/0.25 mm/0.25 μm, He; Program: 35C(0.7min) => 20C/min => 70C => 4C/min => 240C |
Capillary | Stabilwax | 999. | Klesk, Qian, et al., 2004 | 30. m/0.32 mm/1. μm, He; Program: 40C (2min) => 5C/min => 100C => 4C/min => 230C (10min) |
Capillary | Stabilwax | 998. | Klesk and Qian, 2003 | 30. m/0.32 mm/1. μm, He; Program: 40C(2min) => 5C/min => 100C => 4C/min => 230C(10min) |
Capillary | DB-Wax | 982. | Klesk and Qian, 2003, 2 | 30. m/0.25 mm/0.5 μm, He; Program: 40C(2min) => 2C/min => 100C => 10C/min => 230C (5min) |
Capillary | HP-FFAP | 991. | Carrapiso, Ventanas, et al., 2002 | 30. m/0.32 mm/0.25 μm; Program: 35C(5min) => 10C/min => 150C => 20C/min => 250C(10 min) |
Capillary | FFAP | 980. | Engel and Schieberle, 2002 | 30. m/0.32 mm/0.25 μm, He; Program: 40C (2min) => 40C/min => 60C (1min) => 6C/min => 230C (15min) |
Capillary | FFAP | 985. | Jezussek, Juliano, et al., 2002 | 30. m/0.25 mm/0.25 μm, He; Program: 40C(1min) => 40C/min => 50C(2min) => 6C/min => 240C |
Capillary | FFAP | 1000. | Kirchhoff and Schieberle, 2002 | 30. m/0.32 mm/0.25 μm, He; Program: 35C (2min) => 60C/min => 50C (2min) => 6C/min => 240C (10min) |
Capillary | FFAP | 990. | Rhlid, Fleury, et al., 2002 | 30. m/0.32 mm/0.25 μm; Program: 50C (2min) => 6C/min => 180C => 10C/min => 240C(10min) |
Capillary | DB-FFAP | 976. | Zehentbauer and Reineccius, 2002 | 30. m/0.25 mm/0.25 μm, He; Program: 35 0C (2 min) 40 K/min -> 60 0C (2 min) 6 K/min -> 230 0C |
Capillary | FFAP | 1000. | Kirchhoff and Schieberle, 2001 | 30. m/0.32 mm/0.25 μm, He; Program: 40C(2min) => 40C/min => 60C(2min) => 6C/min => 240C(10min) |
Capillary | DB-FFAP | 991. | Munk, Johansen, et al., 2001 | 30. m/0.32 mm/0.25 μm; Program: 40C(2min) => 40C/min => 60C (2min) => 6C/min => 180C => 10C/min => 240C(5min) |
Capillary | FFAP | 979. | Tairu, Hofmann, et al., 2000 | 30. m/0.32 mm/0.25 μm, He; Program: 35C (2min) => 40C/min => 60C (2min) => 6C/min => 180C (5min) => 10C/min => 230C (5min) |
Capillary | FFAP | 989. | Zimmermann and Schieberle, 2000 | 30. m/0.25 mm/0.25 μm, He; Program: 35C(2min) => 40C/min => 60C => 6C/min => 180C 20C/min => 240C(10min) |
Capillary | FFAP | 970. | Buettner and Schieberle, 1999 | 30. m/0.32 mm/0.25 μm, He; Program: 35C (2min) => 40C/min => 60C (2min) => 6C/min => 180C => 10C/min => 230C (10min) |
Capillary | FFAP | 987. | Derail, Hofmann, et al., 1999 | 30. m/0.32 mm/0.25 μm, He; Program: 35C (2min) => 40C/min => 60C => 4C/min => 230C (10min) |
Capillary | FFAP | 987. | Derail, Hofmann, et al., 1999 | 30. m/0.32 mm/0.25 μm, He; Program: 35C (2min) => 40C/min => 60C => 4C/min => 230C (10min) |
Capillary | DB-FFAP | 984. | Mutti and Grosch, 1999 | 30. m/0.32 mm/0.25 μm, He; Program: 40C(2min) => 40C/min => 60C(2min) => 6C/min => 230C(10min) |
Capillary | FFAP | 977. | Fickert and Schieberle, 1998 | 25. m/0.32 mm/0.5 μm, He; Program: 35C (2min) => 40C/min => 60C => 6C/min => 230C (10min) |
Capillary | FFAP | 970. | Hinterholzer, Lemos, et al., 1998 | 30. m/0.32 mm/0.25 μm, He; Program: 35C(2min) => 40C/min => 60C(2min) => 6C/min => 180C => 10C/min => 230C(10 min) |
Capillary | DB-Wax | 982. | Prost, Serot, et al., 1998 | 30. m/0.32 mm/0.5 μm; Program: 50C => 3C/min => 180C => 5C/min => 250C (15min) |
Capillary | DB-Wax | 982. | Prost, Serot, et al., 1998 | 30. m/0.32 mm/0.5 μm; Program: 50C => 3C/min => 180C => 5C/min => 250C (15min) |
Capillary | DB-Wax | 982. | Prost, Serot, et al., 1998 | 30. m/0.32 mm/0.5 μm; Program: 50C => 3C/min => 180C => 5C/min => 250C (15min) |
Capillary | FFAP | 978. | Münch, Hofmann, et al., 1997 | 30. m/0.32 mm/0.25 μm, He; Program: 40C (2min) => 40C/min => 60C (2min) => 240C (10min) |
Capillary | Supelcowax-10 | 985. | Baek and Cadwallader, 1996 | 60. m/0.25 mm/0.25 μm; Program: 40C => (6C/min) => 80C(6min) => (15C/min) => 200C(10min) |
Capillary | FFAP | 968. | Hofmann and Schieberle, 1995 | 30. m/0.32 mm/0.25 μm, He; Program: 40C (2min) => 40C/min => 60C (5min) => 6C/min => 230C (15min) |
Capillary | Supelcowax-10 | 968. | Maignial, Pibarot, et al., 1992 | 60. m/0.25 mm/0.25 μm; Program: 20C(0.5min) => fast => 60C => 4C/min => 220C |
Capillary | Supelcowax-10 | 976. | Sing, Smadja, et al., 1992 | 60. m/0.25 mm/0.25 μm, He; Program: 20C(0.5min) => 60C => 4C/min => 250C |
Capillary | Carbowax 20M | 975. | Whitfield, Shea, et al., 1981 | Column length: 150. m; Column diameter: 0.75 mm; Program: not specified |

Normal alkane RI, non-polar column, temperature ramp

Column type | Active phase | I | Reference | Comment |
---|---|---|---|---|
Capillary | DB-5 MS | 609. | Majcher, Lawrowski, et al., 2010 | 25. m/0.20 mm/0.33 μm, Helium, 40. C @ 1. min, 10. K/min; Tend: 250. C |
Capillary | HP-5 MS | 587. | Kim and Chung, 2009 | 30. m/0.25 mm/0.25 μm, Helium, 35. C @ 5. min, 2. K/min, 195. C @ 30. min |
Capillary | SE-54 | 592. | Laselan, Buettner, et al., 2009 | 30. m/0.32 mm/0.25 μm, 0. C @ 2. min, 6. K/min; Tend: 200. C |
Capillary | SLB-5MS | 599. | Risticevic, Carasek, et al., 2008 | 10. m/0.18 mm/0.18 μm, Helium, 40. C @ 1.5 min, 10. K/min; Tend: 295. C |
Capillary | RTX-5 | 589. | Berdague, Tournayre, et al., 2007 | 60. m/0.32 mm/1. μm, 40. C @ 5. min, 4. K/min, 205. C @ 5. min |
Capillary | SPB-5 | 594. | Vasta, Ratel, et al., 2007 | 60. m/0.32 mm/1. μm, 40. C @ 5. min, 3. K/min, 230. C @ 5. min |
Capillary | DB-5 | 607. | Fadel, Mageed, et al., 2006 | He, 60. C @ 5. min, 4. K/min; Column length: 60. m; Column diameter: 0.32 mm; Tend: 250. C |
Capillary | DB-5 | 607. | Fadel, Mageed, et al., 2006, 2 | He, 50. C @ 5. min, 4. K/min; Column length: 60. m; Column diameter: 0.32 mm; Tend: 250. C |
Capillary | HP-5 | 592.4 | Leffingwell and Alford, 2005 | 60. m/0.32 mm/0.25 μm, He, 30. C @ 2. min, 2. K/min, 260. C @ 28. min |
Capillary | MDN-5 | 585. | van Loon, Linssen, et al., 2005 | 60. m/0.25 mm/0.25 μm, He, 40. C @ 4. min, 4. K/min, 270. C @ 5. min |
Capillary | MDN-5 | 585. | van Loon, Linssen, et al., 2005 | 60. m/0.25 mm/0.25 μm, He, 40. C @ 4. min, 4. K/min, 270. C @ 5. min |
Capillary | SPB-5 | 612. | Pino, Marbot, et al., 2005 | 30. m/0.25 mm/0.25 μm, He, 60. C @ 2. min, 4. K/min, 250. C @ 20. min |
Capillary | 5 % Phenyl methyl siloxane | 593. | Ramírez, Estévez, et al., 2004 | 0. m/0.25 mm/1. μm, He, 40. C @ 10. min, 7. K/min, 250. C @ 5. min |
Capillary | DB-5 | 612. | Pino, Marbot, et al., 2003, 2 | 30. m/0.25 mm/0.25 μm, H2, 60. C @ 10. min, 4. K/min, 280. C @ 40. min |
Capillary | SPB-5 | 602. | Sebastian, Viallon-Fernandez, et al., 2003 | 60. m/0.32 mm/1.0 μm, Helium, 3. K/min; Tstart: 30. C; Tend: 230. C |
Capillary | SPB-5 | 612. | Pino, Marbot, et al., 2002, 3 | 30. m/0.25 mm/0.25 μm, Helium, 60. C @ 2. min, 4. K/min, 250. C @ 20. min |
Capillary | DB-5 | 590. | Sanz, Czerny, et al., 2002 | 30. m/0.32 mm/0.25 μm, He, 40. C @ 2. min, 6. K/min, 230. C @ 5. min |
Capillary | DB-5MS | 613. | Cadwallader and Heo, 2001 | 30. m/0.53 mm/1.5 μm, He, 40. C @ 5. min, 6. K/min, 225. C @ 30. min |
Capillary | DB-5 | 588. | Joffraud, Leroi, et al., 2001 | 60. m/0.32 mm/1. μm, He, 40. C @ 5. min, 3. K/min; Tend: 200. C |
Capillary | AT-1 | 603. | Kelling, 2001 | He, 50. C @ 2. min, 10. K/min; Tend: 300. C |
Capillary | DB-5MS | 606. | Lee, Suriyaphan, et al., 2001 | 60. m/0.25 mm/0.25 μm, He, 40. C @ 5. min, 2. K/min, 200. C @ 30. min |
Capillary | HP-5 | 586. | García, Martín, et al., 2000 | 60. m/0.32 mm/1. μm, He, 3. K/min; Tstart: 40. C; Tend: 240. C |
Capillary | DB-5 | 600. | Kotseridis and Baumes, 2000 | 30. m/0.32 mm/0.5 μm, H2, 60. C @ 3. min, 3. K/min, 245. C @ 20. min |
Capillary | OV-101 | 562. | Tamura, Boonbumrung, et al., 2000 | Nitrogen, 40. C @ 10. min, 2. K/min; Column length: 50. m; Column diameter: 0.25 mm; Tend: 200. C |
Capillary | DB-1 | 560. | Buttery, Ling, et al., 1997 | 30. C @ 25. min, 4. K/min, 200. C @ 20. min; Column length: 60. m; Column diameter: 0.25 mm |
Capillary | DB-5 | 584. | Kondjoyan, Viallon, et al., 1997 | 60. m/0.32 mm/1. μm, 40. C @ 5. min, 3. K/min, 200. C @ 2. min |
Capillary | DB-5 | 593. | Kondjoyan, Viallon, et al., 1997 | 60. m/0.32 mm/1. μm, 40. C @ 5. min, 3. K/min, 200. C @ 2. min |
Capillary | SE-54 | 595. | Milo and Grosch, 1996 | 30. m/0.52 mm/1.5 μm, 6. K/min; Tstart: 5. C; Tend: 230. C |
Capillary | OV-101 | 566. | Roberts and Acree, 1996 | 35. C @ 3. min, 6. K/min; Column length: 12. m; Column diameter: 0.32 mm; Tend: 225. C |
Capillary | OV-101 | 560. | Roberts and Acree, 1996 | 35. C @ 3. min, 6. K/min; Column length: 12. m; Column diameter: 0.32 mm; Tend: 225. C |
Capillary | SPB-1 | 569. | Wong and Lai, 1996 | 50. m/0.2 mm/0.33 μm, He, 40. C @ 3. min, 3. K/min, 200. C @ 30. min |
Capillary | DB-1 | 558. | Buttery and Ling, 1995 | He, 30. C @ 25. min, 4. K/min, 200. C @ 20. min; Column length: 60. m; Column diameter: 0.25 mm |
Capillary | RTX-5 | 595. | Milo and Grosch, 1995 | 30. m/0.52 mm/1.5 μm, He, 6. K/min; Tstart: 5. C; Tend: 230. C |
Capillary | RTX-5 | 595. | Milo and Grosch, 1995 | 30. m/0.52 mm/1.5 μm, He, 6. K/min; Tstart: 5. C; Tend: 230. C |
Capillary | DB-1 | 558. | Buttery, Stern, et al., 1994 | He, 30. C @ 25. min, 4. K/min, 200. C @ 20. min; Column length: 60. m; Column diameter: 0.32 mm |
Capillary | OV-101 | 604. | Roberts and Acree, 1994 | 12. m/0.32 mm/0.52 μm, 35. C @ 3. min, 4. K/min; Tend: 225. C |
Capillary | DB-1 | 568. | Yu, Wu, et al., 1994 | 60. m/0.25 mm/1.0 μm, He, 40. C @ 5. min, 2. K/min, 260. C @ 60. min |
Capillary | DB-5 | 616. | Lee, Macku, et al., 1991 | 60. m/0.25 mm/0.25 μm, 40. C @ 5. min, 2. K/min; Tend: 250. C |
Capillary | OV-101 | 555. | Misharina, Golovnya, et al., 1991 | 50. m/0.32 mm/0.5 μm, He, 4. K/min; Tstart: 50. C; Tend: 250. C |
Capillary | DB-1 | 561. | Habu, Flath, et al., 1985 | 3. K/min; Column length: 50. m; Column diameter: 0.32 mm; Tstart: 0. C; Tend: 250. C |
Capillary | OV-101 | 570. | del Rosario, de Lumen, et al., 1984 | He, 0. C @ 1. min, 3. K/min; Column length: 50. m; Column diameter: 0.31 mm; Tend: 225. C |
Capillary | SP 2100 | 605. | Labropoulos, Palmer, et al., 1982 | Helium, 10. K/min; Column length: 40. m; Column diameter: 0.20 mm; Tstart: 40. C; Tend: 200. C |

Normal alkane RI, non-polar column, custom temperature program

Column type | Active phase | I | Reference | Comment |
---|---|---|---|---|
Capillary | HP-5 | 591. | Fang, Pu, et al., 2012 | 30. m/0.25 mm/0.25 μm, Helium; Program: 30 0C (1 min) 2 0C/min -> 100 0C (5 min) 5 0C/min -> 170 0C |
Capillary | DB-5 | 600. | San-Juan, Petka, et al., 2010 | 30. m/0.32 mm/0.50 μm, Hydrogen; Program: 40 0C (5 min) 4 0C/min -> 100 0C 6 0C/min -> 220 0C (20 min) |
Capillary | HP-1 | 564. | Breme, Langle, et al., 2008 | 50. m/0.20 mm/0.33 μm, Helium; Program: not specified |
Capillary | Squalane | 555. | Chen, 2008 | Program: not specified |
Capillary | CP-Sil 5 Cb | 613. | Collin, Nizet, et al., 2008 | 50. m/0.32 mm/1.20 μm, Nitrogen; Program: 40 0C 20 0C/min -> 85 0C 1 0C/min -> 145 0C 3 0C/min -> 250 0C (30 min) |
Capillary | SLB-5MS | 584. | Risticevic, Carasek, et al., 2008 | 10. m/0.18 mm/0.18 μm, Helium; Program: not specified |
Capillary | DB-5 | 596. | Buettner, 2007 | 30. m/0.32 mm/0.25 μm; Program: 40C(2min) => 40C/min => 60C(2min) => 6C/min => 180C => 15C/min => 230C(10min) |
Capillary | DB-5 MS | 594. | Cajka, Hajslova, et al., 2007 | 30. m/0.25 mm/0.25 μm, Helium; Program: 45 0C (0.75 min) 10 0C/min -> 200 0C 30 0C/min -> 245 0C (1.25 min) |
Capillary | HP-5 | 590. | Carrapiso and Garsia, 2007 | 50. m/0.32 mm/1.05 μm; Program: 35 0C (10 min) 10 0C/min -> 150 0C 20 0C/min -> 250 0C (10 min) |
Capillary | SE-54 | 592. | Lasekan, Buettner, et al., 2007 | 30. m/0.32 mm/0.25 μm; Program: 35C(2min) => 40C/min => 60C(2min) => 6C/min => 180C => 10C/min => 230C(10min) |
Capillary | HP-5MS | 581. | Mallia, Escher, et al., 2007 | Program: not specified |
Capillary | HP-1 | 594. | Senger-Emonnot, Rochard, et al., 2006 | 50. m/0.32 mm/0.52 μm, He; Program: 40C => 2C/min => 130C => 4C/min => 250C (25min) |
Capillary | BPX-5 | 602. | Duflos, Moine, et al., 2005 | 60. m/0.25 mm/0.25 μm, He; Program: 40C(5min) => 5C/min => 100C => 20C/min => 280C (5min) |
Capillary | Methyl Silicone | 575. | Hadorn, Eberhard, et al., 2005 | Program: not specified |
Capillary | Polydimethyl siloxane with 5 % Ph groups | 612. | Pino, Marbot, et al., 2005, 2 | Program: not specified |
Capillary | HP-5 | 581. | Thierry, Maillard, et al., 2005 | 60. m/0.32 mm/1. μm; Program: not specified |
Capillary | BPX-5 | 595. | Machiels, Istasse, et al., 2004 | 60. m/0.32 mm/1. μm, He; Program: 40C (4min) => 2C/min => 90C => 4C/min => 130C => 8C/min => 250 C (10min) |
Capillary | SE-30 | 575. | Vinogradov, 2004 | Program: not specified |
Capillary | RTX-5 MS | 593. | Machiels and Istasse, 2003 | 60. m/0.25 mm/0.5 μm, He; Program: 35C (3min) => 10C/min => 50C => 4C/min => 200C => 50C/min => 250C (10min) |
Capillary | HP-5MS | 612. | Martí, Mestres, et al., 2003 | 30. m/0.25 mm/0.25 μm, He; Program: 40C(5min) => 2C/min => 120C => 10C/min => 210C (30min) |
Capillary | DB-5 | 593. | Qian and Reineccius, 2003 | 30. m/0.32 mm/1. μm; Program: 35C(4min) => 2C/min => 130C => 4C/min => 250C |
Capillary | DB-5MS | 587. | Young, Lane, et al., 2003 | 30. m/0.25 mm/1. μm; Program: 50C => 3C/min => 160C => 6C/min => 250C => 25C/min => 325C |
Capillary | DB-5 | 610. | Bücking and Steinhart, 2002 | 30. m/0.53 mm/1.5 μm; Program: -5C(1min) => 4C/min => 50C => 6C/min => 120C => 8C/min => 250C(2min) |
Capillary | CP Sil 5 CB | 578. | Counet, Callemien, et al., 2002 | 50. m/0.32 mm/1.2 μm; Program: 36C => 20C/min => 85C => 1C/min => 145C=3C/min => 250C(30min) |
Capillary | CP Sil 5 CB | 578. | Counet, Callemien, et al., 2002 | 50. m/0.32 mm/1.2 μm; Program: 36C => 20C/min => 85C => 1C/min => 145C=3C/min => 250C(30min) |
Capillary | MFE-73 | 600. | Ferreira, Ortín, et al., 2002 | H2; Program: not specified |
Capillary | Methyl phenyl siloxane (not specified) | 584. | Poligne, Collignan, et al., 2002 | Program: not specified |
Capillary | CP Sil 8 CB | 604. | Duckham, Dodson, et al., 2001 | 60. m/0.25 mm/0.25 μm; Program: not specified |
Capillary | BPX-5 | 580. | van Ruth, Grossmann, et al., 2001 | 60. m/0.32 mm/1. μm, He; Program: -30C(1min) => 100C/min => 40C(4min) => 2C/min => 90C => 4C/min => 130C => 8C/min => 250C |
Capillary | DB-5 | 587. | Young and Baumeister, 1999 | 30. m/0.53 mm/1. μm; Program: -40C(10min) => 70C/min => 40C(5min) => 3C/min => 180C => 6C/min => 280C(5min) |
Capillary | RTX-5 | 594. | Masanetz, Guth, et al., 1998 | Program: not specified |
Capillary | SE-54 | 595. | Zehentbauer and Grosch, 1998 | 25. m/0.32 mm/0.25 μm, He; Program: 35C(2min) => 50C/min => 60C(2min) => 4C/min => 230C |
Capillary | SPB-1 | 563. | Flanagan, Streete, et al., 1997 | 60. m/0.53 mm/5. μm, He; Program: 40C(6min) => 5C/min => 80C => 10C/min => 200C |
Capillary | DB-5 | 600. | Guth, 1997 | 30. m/0.32 mm/0.25 μm; Program: 35C (1min) => 40C/min => 60C (1min) => 6C/min => 250C (10min) |
Capillary | SE-54 | 600. | Guth, 1997 | 30. m/0.32 mm/0.25 μm; Program: 35C (1min) => 40C/min => 60C (1min) => 6C/min => 250C (10min) |
Capillary | SE-54 | 592. | Schermann and Schieberle, 1997 | 30. m/0.32 mm/0.25 μm, He; Program: 35C (2min) => 40C/min => 60C (2min) => 6C/min => 180C => 10C/min => 240C |
Capillary | SE-54 | 592. | Schermann and Schieberle, 1997 | 30. m/0.32 mm/0.25 μm, He; Program: 35C (2min) => 40C/min => 60C (2min) => 6C/min => 180C => 10C/min => 240C |
Capillary | SE-54 | 592. | Schermann and Schieberle, 1997 | 30. m/0.32 mm/0.25 μm, He; Program: 35C (2min) => 40C/min => 60C (2min) => 6C/min => 180C => 10C/min => 240C |
Capillary | DB-5 | 595. | Mateo and Zumalacárregui, 1996 | 50. m/0.32 mm/0.25 μm, He; Program: 40C (10min) => 3C/min => 95C => 10C/min => 270C (10min) |
Capillary | Methyl Silicone | 560. | Misharina, 1995 | Program: not specified |
Capillary | SE-54 | 600. | Milo and Grosch, 1993 | He; Column length: 30. m; Column diameter: 0.32 mm; Program: 40 0C -> (unknowm rate) 50 0C (2 min) 6 0C/min -> 200 0C |
Capillary | SE-54 | 580. | Blank, Sen, et al., 1992 | Program: not specified |
Capillary | SPB-1 | 563. | Strete, Ruprah, et al., 1992 | 60. m/0.53 mm/5.0 μm, Helium; Program: 40 0C (6 min) 5 0C/min -> 80 0C 10 0C/min -> 200 0C |
Capillary | DB-1 | 558. | Takeoka, Flath, et al., 1988 | 30. m/0.25 mm/0.25 μm, H2; Program: 30C (2min) => 2C/min => 150C => 4C/min => 250C |
Capillary | DB-1 | 563. | Takeoka, Flath, et al., 1988 | 30. m/0.25 mm/0.25 μm, H2; Program: 30C (2min) => 2C/min => 150C => 4C/min => 250C |
Capillary | OV-101 | 575. | Shibamoto, 1987 | Program: not specified |
Capillary | OV-1, SE-30, Methyl silicone, SP-2100, OV-101, DB-1, etc. | 619. | Waggott and Davies, 1984 | Hydrogen; Column length: 50. m; Column diameter: 0.32 mm; Program: not specified |
Capillary | SE-30 | 565. | Heydanek and McGorrin, 1981 | He; Column length: 50. m; Column diameter: 0.5 mm; Program: -10C (8min) => 12C/min => 26C => 3C/min => 170C (30min) |

Normal alkane RI, polar column, temperature ramp

Column type | Active phase | I | Reference | Comment |
---|---|---|---|---|
Capillary | FFAP | 999. | Budryn, Nebesny, et al., 2011 | 30. m/0.32 mm/0.50 μm, Nitrogen, 35. C @ 5. min, 4. K/min, 250. C @ 45. min |
Capillary | DB-Wax | 988. | Onishi, Inoue, et al., 2011 | 60. m/0.25 mm/0.25 μm, Helium, 50. C @ 2. min, 3. K/min, 220. C @ 20. min |
Capillary | DB-Wax | 964. | Chen, Song, et al., 2009 | 30. m/0.32 mm/0.25 μm, Helium, 40. C @ 2. min, 6. K/min, 230. C @ 20. min |
Capillary | DB-Wax | 968. | Chen, Song, et al., 2009 | 30. m/0.32 mm/0.25 μm, Helium, 40. C @ 2. min, 6. K/min, 230. C @ 20. min |
Capillary | DB-FFAP | 993. | Laselan, Buettner, et al., 2009 | 30. m/0.32 mm/0.25 μm, 0. C @ 2. min, 6. K/min; Tend: 200. C |
Capillary | CP-Wax | 991. | Mo, Fan, et al., 2009 | 60. m/0.25 mm/0.25 μm, Helium, 50. C @ 2. min, 6. K/min, 230. C @ 15. min |
Capillary | DB-Wax | 968. | Rochat, Egger, et al., 2009 | 30. m/0.25 mm/0.25 μm, Helium, 60. C @ 3. min, 8. K/min, 200. C @ 9.5 min |
Capillary | DB-Wax | 973. | Rochat, Egger, et al., 2009 | 30. m/0.25 mm/0.25 μm, Helium, 60. C @ 3. min, 8. K/min, 200. C @ 9.5 min |
Capillary | DB-Wax | 991. | Rochat, Egger, et al., 2009 | 30. m/0.25 mm/0.25 μm, Helium, 60. C @ 3. min, 8. K/min, 200. C @ 9.5 min |
Capillary | DB-Wax | 995. | Rochat, Egger, et al., 2009 | 30. m/0.25 mm/0.25 μm, Helium, 60. C @ 3. min, 8. K/min, 200. C @ 9.5 min |
Capillary | DB-Wax | 998. | Rochat, Egger, et al., 2009 | 30. m/0.25 mm/0.25 μm, Helium, 60. C @ 3. min, 8. K/min, 200. C @ 9.5 min |
Capillary | CP-Wax 57 CB | 969. | Callejon, Morales, et al., 2008 | 50. m/0.25 mm/0.20 μm, Hydrogen, 35. C @ 5. min, 4. K/min, 150. C @ 17.5 min |
Capillary | DB-Wax | 967. | Ganeko, Shoda, et al., 2008 | 4. K/min; Column length: 60. m; Column diameter: 0.35 mm; Tstart: 40. C; Tend: 200. C |
Capillary | ZB-Wax | 1000. | Marin, Pozrl, et al., 2008 | 60. m/0.32 mm/0.50 μm, Helium, 40. C @ 5. min, 4. K/min, 220. C @ 5. min |
Capillary | FFAP | 999. | Nebesny, Budryn, et al., 2007 | 30. m/0.32 mm/0.5 μm, N2, 35. C @ 5. min, 4. K/min, 320. C @ 45. min |
Capillary | CP-Wax 52CB | 976. | Povolo, Contarini, et al., 2007 | 60. m/0.32 mm/0.5 μm, He, 40. C @ 8. min, 4. K/min, 220. C @ 20. min |
Capillary | CP-Wax 52CB | 987. | Povolo, Contarini, et al., 2007 | 60. m/0.32 mm/0.5 μm, He, 40. C @ 8. min, 4. K/min, 220. C @ 20. min |
Capillary | DB-Wax | 996. | Kishimoto, Wanikawa, et al., 2006 | 15. m/0.32 mm/0.25 μm, He, 6. K/min, 230. C @ 20. min; Tstart: 40. C |
Capillary | HP-Innowax | 990. | Senger-Emonnot, Rochard, et al., 2006 | 60. m/0.32 mm/0.5 μm, He, 2. K/min, 220. C @ 10. min; Tstart: 60. C |
Capillary | DB-Wax | 978. | Spadone, Matthey-Doret, et al., 2006 | 60. m/0.25 mm/0.25 μm, Helium, 35. C @ 3. min, 6. K/min, 240. C @ 10. min |
Capillary | Carbowax 20M | 971. | de la Fuente, Martinez-Castro, et al., 2005 | 50. m/0.25 mm/0.25 μm, Helium, 40. C @ 2. min, 4. K/min, 190. C @ 30. min |
Capillary | Supelcowax-10 | 994. | Rochat and Chaintreau, 2005 | 60. m/0.53 mm/1. μm, He, 40. C @ 2. min, 4. K/min, 240. C @ 20. min |
Capillary | Supelcowax-10 | 995. | Rochat and Chaintreau, 2005 | 60. m/0.53 mm/1. μm, He, 40. C @ 2. min, 4. K/min, 240. C @ 20. min |
Capillary | Supelcowax-10 | 996. | Rochat and Chaintreau, 2005 | 60. m/0.53 mm/1. μm, He, 40. C @ 2. min, 4. K/min, 240. C @ 20. min |
Capillary | DB-Wax | 983. | Culleré, Escudero, et al., 2004 | 30. m/0.32 mm/0.5 μm, H2, 40. C @ 5. min, 4. K/min; Tend: 200. C |
Capillary | TC-Wax | 984. | Ishikawa, Ito, et al., 2004 | 60. m/0.25 mm/0.5 μm, He, 40. C @ 8. min, 3. K/min; Tend: 230. C |
Capillary | HP-Innowax | 963. | Soria, Gonzalez, et al., 2004 | 50. m/0.2 mm/0.2 μm, He, 45. C @ 2. min, 4. K/min, 190. C @ 50. min |
Capillary | HP-Wax | 962. | Andueza, Maeztu, et al., 2003 | 60. m/0.25 mm/0.5 μm, He, 40. C @ 6. min, 3. K/min; Tend: 199. C |
Capillary | HP-Wax | 962. | Andueza, de Peña, et al., 2003 | 60. m/0.25 mm/0.5 μm, He, 40. C @ 6. min, 3. K/min; Tend: 190. C |
Capillary | DB-Wax | 977. | Tanaka, Yamauchi, et al., 2003 | 30. m/0.25 mm/0.25 μm, 30. C @ 1. min, 4. K/min; Tend: 250. C |
Capillary | DB-Wax | 980. | Tanaka, Yamauchi, et al., 2003 | 30. m/0.25 mm/0.25 μm, 30. C @ 1. min, 4. K/min; Tend: 250. C |
Capillary | DB-Wax | 989. | Ferreira, Ortín, et al., 2002 | 30. m/0.32 mm/0.5 μm, H2, 40. C @ 5. min, 4. K/min; Tend: 200. C |
Capillary | DB-Wax | 973. | Kumazawa and Masuda, 2002 | 30. m/0.25 mm/0.25 μm, He, 5. K/min; Tstart: 40. C; Tend: 210. C |
Capillary | DB-Wax | 975. | Kumazawa and Masuda, 2002 | 60. m/0.25 mm/0.25 μm, He, 5. K/min; Tstart: 40. C; Tend: 210. C |
Capillary | FFAP | 955. | Lecanu, Ducruet, et al., 2002 | 30. m/0.32 mm/1. μm, He, 35. C @ 3. min, 5. K/min; Tend: 240. C |
Capillary | DB-FFAP | 982. | Sanz, Czerny, et al., 2002 | 30. m/0.32 mm/0.25 μm, He, 40. C @ 2. min, 6. K/min, 230. C @ 5. min |
Capillary | HP-Wax | 962. | Sanz, Maeztu, et al., 2002 | 60. m/0.25 mm/0.5 μm, He, 40. C @ 6. min, 3. K/min; Tend: 190. C |
Capillary | EC-1000 | 1005. | Bendall, 2001 | 30. m/0.25 mm/0.25 μm, He, 35. C @ 5. min, 5. K/min, 230. C @ 15. min |
Capillary | DB-Wax | 986. | Cadwallader and Heo, 2001 | 30. m/0.53 mm/1. μm, He, 40. C @ 5. min, 6. K/min, 225. C @ 30. min |
Capillary | DB-Wax | 977. | Ferreira, Aznar, et al., 2001 | 30. m/0.32 mm/0.5 μm, H2, 40. C @ 5. min, 4. K/min, 200. C @ 60. min |
Capillary | HP-Wax | 962. | Maeztu, Sanz, et al., 2001 | 60. m/0.25 mm/0.5 μm, He, 40. C @ 6. min, 3. K/min; Tend: 190. C |
Capillary | HP-Wax | 962. | Sanz, Ansorena, et al., 2001 | 60. m/0.25 mm/0.5 μm, He, 40. C @ 6. min, 3. K/min; Tend: 190. C |
Capillary | DB-Wax | 981. | Kim, Baek, et al., 2000 | 30. m/0.32 mm/0.25 μm, 40. C @ 5. min, 8. K/min, 280. C @ 30. min |
Capillary | DB-Wax | 987. | Kotseridis and Baumes, 2000 | 30. m/0.32 mm/0.5 μm, H2, 60. C @ 3. min, 3. K/min, 245. C @ 20. min |
Capillary | DB-Wax | 978. | Tamura, Boonbumrung, et al., 2000 | Nitrogen, 40. C @ 10. min, 2. K/min; Column length: 60. m; Column diameter: 0.25 mm; Tend: 200. C |
Capillary | DB-Wax | 972. | Umano, Hagi, et al., 2000 | 60. m/0.25 mm/0.25 μm, He, 40. C @ 2. min, 2. K/min; Tend: 200. C |
Capillary | DB-Wax | 972. | Kumazawa and Masuda, 1999 | 30. m/0.53 mm/1. μm, 5. K/min; Tstart: 40. C; Tend: 210. C |
Capillary | DB-Wax | 975. | Kumazawa and Masuda, 1999 | 60. m/0.25 mm/0.25 μm, 5. K/min; Tstart: 40. C; Tend: 210. C |
Capillary | Carbowax 20M | 969. | Lopez, Ferreira, et al., 1999 | 60. m/0.32 mm/0.5 μm, He, 40. C @ 5. min, 2. K/min; Tend: 190. C |
Capillary | DB-Wax | 987. | Schlüter, Steinhart, et al., 1999 | 60. m/0.32 mm/0.5 μm, He, 34. C @ 3. min, 5. K/min, 200. C @ 10. min |
Capillary | DB-Wax | 954. | Schlüter, Steinhart, et al., 1999 | 60. m/0.32 mm/0.25 μm, He, 34. C @ 3. min, 5. K/min, 200. C @ 10. min |
Capillary | DB-Wax | 970. | Suriyaphan, Drake, et al., 1999 | 30. m/0.33 mm/0.25 μm, Helium, 40. C @ 5. min, 6. K/min, 200. C @ 30. min |
Capillary | DB-Wax | 977. | Umano, Nakahara, et al., 1999 | 60. m/0.25 mm/0.25 μm, He, 40. C @ 2. min, 2. K/min; Tend: 200. C |
Capillary | DB-Wax | 966. | Buttery and Ling, 1998 | 30. C @ 4. min, 2. K/min, 170. C @ 30. min; Column length: 60. m; Column diameter: 0.25 mm |
Capillary | Carbowax 20M | 968. | Roberts and Acree, 1996 | 50. C @ 3. min, 6. K/min; Column length: 15. m; Column diameter: 0.32 mm; Tend: 225. C |
Capillary | Supelcowax-10 | 990. | Wong and Lai, 1996 | 60. m/0.25 mm/0.25 μm, He, 40. C @ 3. min, 3. K/min, 200. C @ 30. min |
Capillary | DB-Wax | 960. | Christensen and Reineccius, 1995 | 30. m/0.25 mm/0.25 μm, 20. C @ 1. min, 5. K/min; Tend: 230. C |
Capillary | DB-Wax | 967. | Umano, Hagi, et al., 1995 | He, 40. C @ 2. min, 2. K/min; Column length: 60. m; Column diameter: 0.25 mm; Tend: 200. C |
Capillary | Carbowax 20M | 948. | Kawakami and Kobayashi, 1991 | He, 60. C @ 4. min, 2. K/min; Column length: 50. m; Column diameter: 0.25 mm; Tend: 180. C |
Packed | Carbowax | 963. | Schieberle and Grosch, 1983 | He, Chromosorb G AW DMCS, 4. K/min; Column length: 3. m; Tstart: 60. C; Tend: 180. C |
Capillary | Carbowax 20M | 935. | Yamaguchi and Shibamoto, 1980 | N2, 1. K/min; Column length: 50. m; Column diameter: 0.28 mm; Tstart: 80. C; Tend: 170. C |
Capillary | Carbowax 20M | 938. | Yamaguchi and Shibamoto, 1980 | N2, 1. K/min; Column length: 50. m; Column diameter: 0.28 mm; Tstart: 80. C; Tend: 170. C |

Normal alkane RI, polar column, custom temperature program

Column type | Active phase | I | Reference | Comment |
---|---|---|---|---|
Capillary | DB-Wax | 1000. | Welke, Manfroi, et al., 2012 | 30. m/0.25 mm/0.25 μm, Helium; Program: not specified |
Capillary | DB-Wax | 975. | Welke, Manfroi, et al., 2012 | 30. m/0.25 mm/0.25 μm, Helium; Program: not specified |
Capillary | SOLGel-Wax | 965. | Johanningsmeier and McFeeters, 2011 | 30. m/0.25 mm/0.25 μm, Helium; Program: 40 0C (2 min) 5 0C/min -> 140 0C 10 0C/min -> 250 0C (3 min) |
Capillary | CP-Wax 52 CB | 987. | Povolo, Cabassi, et al., 2011 | Program: not specified |
Capillary | HP-Innowax | 987. | Xiao, Dai, et al., 2011 | 60. m/0.25 mm/0.25 μm, Helium; Program: 40 0C (2 min) 3 0C/min -> 150 0C 5 0C/min -> 220 0C (5 min) |
Capillary | DB-Wax | 957. | San-Juan, Petka, et al., 2010 | 30. m/0.32 mm/0.50 μm, Hydrogen; Program: 40 0C (5 min) 4 0C/min -> 100 0C 6 0C/min -> 220 0C (20 min) |
Capillary | DB-Wax | 957. | Ferreira, Juan, et al., 2009 | 30. m/0.32 mm/0.50 μm; Program: 40 0C (5 min) 4 0C/min -> 100 0C 6 0C/min -> 220 0C (40 min) |
Capillary | DB-Wax | 960. | Rochat, Egger, et al., 2009 | 30. m/0.25 mm/0.25 μm, Helium; Program: not specified |
Capillary | Supelcowax-10 | 975. | Soria, Martinez-Castro, et al., 2009 | 50. m/0.25 mm/0.25 μm, Helium; Program: 45 0C (15 min) 3 0C/min -> 75 0C 5 0C/min -> 180 0C (10 min) |
Capillary | Supelcowax 10 | 975. | Soria, Martinez-Castro, et al., 2008 | 50. m/0.25 mm/0.25 μm, Helium; Program: 45 0C (15 min) 3 0C/min -> 75 0C 5 0C/min -> 180 0C (10 min) |
Capillary | Supelcowax 10 | 975. | Soria, Martinez-Castro, et al., 2008 | 50. m/0.25 mm/0.25 μm, Helium; Program: 45 0C (15 min) 3 0C/min -> 75 0C 5 0C/min -> 180 0C (10 min) |
Capillary | Supelcowax-10 | 986. | Berard, Bianchi, et al., 2007 | 30. m/0.25 mm/0.25 μm, He; Program: 35C(8min) => 6C/min => 60C => 4C/min => 160C => 20C/min => 200C(1min) |
Capillary | Supelcowax-10 | 988. | Berard, Bianchi, et al., 2007 | 30. m/0.25 mm/0.25 μm, He; Program: 35C(8min) => 6C/min => 60C => 4C/min => 160C => 20C/min => 200C(1min) |
Capillary | DB-FFAP | 981. | Buettner, 2007 | 30. m/0.32 mm/0.25 μm; Program: 40C(2min) => 40C/min => 60C(2min) => 6C/min => 180C => 15C/min => 230C(10min) |
Capillary | DB-FFAP | 970. | Buettner, 2007 | 30. m/0.32 mm/0.25 μm; Program: 40C(2min) => 40C/min => 60C(2min) => 6C/min => 180C => 15C/min => 230C(10min) |
Capillary | HP-FFAP | 991. | Carrapiso and Garsia, 2007 | 30. m/0.32 mm/0.25 μm; Program: 35 0C (10 min) 10 0C/min -> 150 0C 20 0C/min -> 250 0C (10 min) |
Capillary | DB-Wax | 979. | Gonzalez-Rios, Suarez-Quiroz, et al., 2007 | 30. m/0.25 mm/0.25 μm, Hydrogen; Program: 44 0C 3 0C/min -> 170 0C 8 0C/min -> 250 0C |
Capillary | DB-Wax | 963. | Gonzalez-Rios, Suarez-Quiroz, et al., 2007 | 30. m/0.25 mm/0.25 μm, Hydrogen; Program: not specified |
Capillary | DB-FFAP | 993. | Lasekan, Buettner, et al., 2007 | 30. m/0.32 mm/0.25 μm; Program: 35C(2min) => 40C/min => 50C(2min) => 6C/min => 180C => 10C/min => 230C(10min) |
Capillary | DB-Wax Etr | 995. | Loskos, Hernandez-Orte, et al., 2007 | 60. m/0.25 mm/0.5 μm, He; Program: 40C(3min) => 10C/min => 90C => 2C/min => 230C (37min) |
Capillary | DB-Wax | 941. | Tian, Zhang, et al., 2007 | 30. m/0.25 mm/0.25 μm, He; Program: 50 0C (2 min) 6 0C/min -> 150 0C 8 0C/min -> 230 0C (15 min) |
Capillary | HP-Innowax | 977. | Viegas and Bassoli, 2007 | 60. m/0.32 mm/0.25 μm, Helium; Program: 40 0C (5 min) 4 0C/min -> 60 0C (5 min) 8 0C/min -> 250 0C (3 min) |
Capillary | HP-Innowax | 976. | Viegas and Bassoli, 2007 | 60. m/0.32 mm/0.25 μm, Helium; Program: not specified |
Capillary | Supelcowax-10 | 935. | Kourkoutas, Kandylis, et al., 2006 | 60. m/0.32 mm/0.25 μm, He; Program: 35C(3min) => 5C/min => 110C => 10C/min => 240C (10min) |
Capillary | CP-Wax 58CB | 966. | Tokitomo, Steihaus, et al., 2005 | 25. m/0.32 mm/0.20 μm, Helium; Program: 40 0C (2 min) 40 0C/min -> 60 0C (1 min) 6 0C/min -> 180 0C 10 0C/min -> 240 0C (5 min) |
Capillary | DB-FFAP | 970. | Buettner and Welle, 2004 | 30. m/0.32 mm/0.25 μm, He; Program: 40C (2min) => 40C/min => 60C(2min) => 6C/min => 180C => 15C/min => 230C(10min) |
Capillary | DB-FFAP | 970. | Buettner, 2004 | 30. m/0.32 mm/0.25 μm, He; Program: 40C(2min) => 40C/min => 60C(2min) => 6C/min => 180C => 15C/min => 230C (10min) |
Capillary | DB-FFAP | 981. | Buettner, 2004 | 30. m/0.32 mm/0.25 μm, He; Program: 40C(2min) => 40C/min => 60C(2min) => 6C/min => 180C => 15C/min => 230C (10min) |
Capillary | FFAP | 984. | Didzbalis, Ritter, et al., 2004 | 30. m/0.32 mm/0.25 μm, He; Program: 35C(1min) => 60C/min => 60C => 6C/min => 230C |
Capillary | Carbowax 20M | 963. | Vinogradov, 2004 | Program: not specified |
Capillary | Supelcowax-10 | 985. | Baek and Cadwallader, 2003 | 60. m/0.25 mm/0.25 μm; Program: not specified |
Capillary | CP-WAX 57CB | 980. | Martí, Mestres, et al., 2003 | 50. m/0.25 mm/0.2 μm, He; Program: 40C(10min) => 5C/min => 100C => 3C/min => 180C => 20C/min => 210C (10min) |
Capillary | DB-Wax | 979. | Peterson and Reineccius, 2003, 2 | Program: not specified |
Capillary | DB-Wax | 970. | Qian and Reineccius, 2003 | 60. m/0.32 mm/0.5 μm, He; Program: 35C(4min) => 2C/min => 130C => 4C/min => 250C |
Capillary | DB-FFAP | 968. | Triqui and Bouchriti, 2003 | 30. m/0.3 mm/0.25 μm, H2; Program: 35C (1min) => 40C/min => 60C (5min) => 4C/min => 220C |
Capillary | FFAP | 990. | Bel Rhild, Fleury, et al., 2002 | 30. m/0.32 mm/0.25 μm, Helium; Program: 50 0C (2 min) 6 0C/min -> 180 0C 10 0C/min -> 180 0C (10 min) |
Capillary | FFAP | 990. | Bel Rhild, Fleury, et al., 2002, 2 | 30. m/0.32 mm/0.25 μm, Helium; Program: 50 0C (2 min) 6 oC/min -> 180 0C 10 0C/min -> 240 0C (10 min) |
Capillary | FFAP | 976. | Zehentbauer and Grosch, 1998 | 25. m/0.32 mm/0.25 μm, He; Program: 35C(2min) => 40C/min => 60C(2min) => 6C/min => 230C |
Capillary | DB-FFAP | 967. | Guth, 1997 | 30. m/0.32 mm/0.25 μm; Program: 35C (1min) => 40C/min => 60C (1min) => 6C/min => 250C (10min) |
Capillary | DB-FFAP | 967. | Guth, 1997 | 30. m/0.32 mm/0.25 μm; Program: 35C (1min) => 40C/min => 60C (1min) => 6C/min => 250C (10min) |
Capillary | DB-FFAP | 981. | Lizárraga-Guerra, Guth, et al., 1997 | He; Column length: 30. m; Column diameter: 0.32 mm; Program: 35C => 40C/min => 60C (1min) => 6C/min => 250C |
Capillary | FFAP | 984. | Schermann and Schieberle, 1997 | 30. m/0.32 mm/0.25 μm, He; Program: 35C (2min) => 40C/min => 60C (2min) => 6C/min => 180C => 10C/min => 240C |
Capillary | FFAP | 984. | Schermann and Schieberle, 1997 | 30. m/0.32 mm/0.25 μm, He; Program: 35C (2min) => 40C/min => 60C (2min) => 6C/min => 180C => 10C/min => 240C |
Capillary | CP-Wax 52CB | 962. | Luning, de Rijk, et al., 1994 | 50. m/0.32 mm/1.5 μm; Program: 40C => 2C/min => 150C => 10C/min => 250C |
Capillary | CP-Wax 52CB | 962. | Luning, de Rijk, et al., 1994 | 50. m/0.32 mm/1.5 μm; Program: 40C => 2C/min => 150C => 10C/min => 250C |
Capillary | Supelcowax-10 | 980. | Schieberle and Grosch, 1994 | He; Column length: 30. m; Column diameter: 0.32 mm; Program: 35C => 40C/min => 60C(2min) => 4C/min => 240C |
Capillary | FFAP | 967. | Guth and Grosch, 1993 | Program: not specified |
Capillary | DB-Wax | 980. | Milo and Grosch, 1993 | 30. m/0.25 mm/0.5 μm, He; Program: 35C => 40C/min => 50C(2min) => 6C/min => 200C |
Capillary | FFAP | 990. | Blank, Sen, et al., 1992 | Program: not specified |
Capillary | Carbowax 20M | 963. | Shibamoto, 1987 | Program: not specified |
Capillary | Carbowax 400, Carbowax 20M, Carbowax 1540, Carbowax 4000, Superox 06, PEG 20M, etc. | 949. | Waggott and Davies, 1984 | Hydrogen; Column length: 50. m; Column diameter: 0.32 mm; Program: not specified |
Capillary | Carbowax 400, Carbowax 20M, Carbowax 1540, Carbowax 4000, Superox 06, PEG 20M, etc. | 972. | Waggott and Davies, 1984 | Hydrogen; Column length: 50. m; Column diameter: 0.32 mm; Program: not specified |

References

Nicholson, Szwarc, et al., 1954
Nicholson, G.R.; Szwarc, M.; Taylor, J.W.,
The heats of formation of diacetyl and of benzyl methyl ketone in the vapour phase,
J. Chem. Soc., 1954, 2767-2769. [all data]
Weast and Grasselli, 1989
CRC Handbook of Data on Organic Compounds, 2nd Editon, Weast,R.C and Grasselli, J.G., ed(s)., CRC Press, Inc., Boca Raton, FL, 1989, 1. [all data]
Othmer, 1943
Othmer, D.F.,
Composition of vapors from boiling binary solutions,
Ind. Eng. Chem., 1943, 35, 614-20. [all data]
Sabatier and Mailhe, 1909
Sabatier, P.; Mailhe, A.,
New Applications of the General Method of Hydrogenation with Various Metals,
Ann. Chim. Phys., 1909, 16, 70. [all data]
Sabatier and Mailhe, 1907
Sabatier, P.; Mailhe, A.,
The Direct Hydrogenation of Methyl Diketones,
C. R. Hebd. Seances Acad. Sci., 1907, 144, 1086. [all data]
Stephenson and Malanowski, 1987
Stephenson, Richard M.; Malanowski, Stanislaw,
Handbook of the Thermodynamics of Organic Compounds, 1987, https://doi.org/10.1007/978-94-009-3173-2
. [all data]
Neely and Hall, 1972
Neely, William C.; Hall, Terry D.,
Vapor pressure of biacetyl,
J. Chem. Eng. Data, 1972, 17, 3, 294-295, https://doi.org/10.1021/je60054a010
. [all data]
Nicholson, Szwarc, et al., 1954, 2
Nicholson, G.R.; Szwarc, M.; Taylor, J. Watson,
The heats of formation of diacetyl and of benzyl methyl ketone in the vapour phase,
J. Chem. Soc., 1954, 2767, https://doi.org/10.1039/jr9540002767
. [all data]
Hunter and Lias, 1998
Hunter, E.P.; Lias, S.G.,
Evaluated Gas Phase Basicities and Proton Affinities of Molecules: An Update,
J. Phys. Chem. Ref. Data, 1998, 27, 3, 413-656, https://doi.org/10.1063/1.556018
. [all data]
Kebarle and Chowdhury, 1987
Kebarle, P.; Chowdhury, S.,
Electron affinities and electron transfer reactions,
Chem. Rev., 1987, 87, 513. [all data]
Compton, Christophorou, et al., 1966
Compton, R.N.; Christophorou, L.G.; Hurst, G.S.; Reinhardt, P.W.,
Nondissociative Electron Capture in Complex Molecules and Negative Ion Lifetimes,
J. Chem. Phys., 1966, 45, 12, 4634, https://doi.org/10.1063/1.1727547
. [all data]
Traeger, McLouglin, et al., 1982
Traeger, J.C.; McLouglin, R.G.; Nicholson, A.J.C.,
Heat of formation for acetyl cation in the gas phase,
J. Am. Chem. Soc., 1982, 104, 5318. [all data]
Watanabe, Nakayama, et al., 1962
Watanabe, K.; Nakayama, T.; Mottl, J.,
Ionization potentials of some molecules,
J. Quant. Spectry. Radiative Transfer, 1962, 2, 369. [all data]
Watanabe, 1957
Watanabe, K.,
Ionization potentials of some molecules,
J. Chem. Phys., 1957, 26, 542. [all data]
Verheijdt and Cerfontain, 1982
Verheijdt, P.L.; Cerfontain, H.,
Dipole moments, spectroscopy, and ground and excited state conformations of cycloalkane-1,2-diones,
J. Chem. Soc. Perkin Trans. 2, 1982, 1541. [all data]
Kimura, Katsumata, et al., 1981
Kimura, K.; Katsumata, S.; Achiba, Y.; Yamazaki, T.; Iwata, S.,
Ionization energies, Ab initio assignments, and valence electronic structure for 200 molecules
in Handbook of HeI Photoelectron Spectra of Fundamental Organic Compounds, Japan Scientific Soc. Press, Tokyo, 1981. [all data]
Von Niessen, Bieri, et al., 1980
Von Niessen, W.; Bieri, G.; Asbrink, L.,
30.4 nm He(II) photoelectron spectra of organic molecules. Part III. Oxo-compounds (C,H,O),
J. Electron Spectrosc. Relat. Phenom., 1980, 21, 175. [all data]
Kobayashi, 1978
Kobayashi, T.,
A new rule for photoelectron angular distributions of molecules,
Phys. Lett. A, 1978, 69, 31. [all data]
McGlynn and Meeks, 1975
McGlynn, S.P.; Meeks, J.L.,
Photoelectron spectra of carbonyls: Acetaldehyde, acetamide, biacetyl, pyruvic acid, methyl pyruvate and vamide,
J. Electron Spectrosc. Relat. Phenom., 1975, 6, 269. [all data]
Kelder, Cerfontain, et al., 1974
Kelder, J.; Cerfontain, H.; Higginson, B.R.; Lloyd, D.R.,
Photoelectron and ultraviolet absorption spectra of cyclopropyl conjugated 1,2-diketones,
Tetrahedron Lett., 1974, 739. [all data]
Arnett, Newkome, et al., 1974
Arnett, J.F.; Newkome, G.; Mattice, W.L.; McGlynn, S.P.,
Excited electronic states of the α-dicarbonyls,
J. Am. Chem. Soc., 1974, 96, 4385. [all data]
Cowan, Gleiter, et al., 1971
Cowan, D.O.; Gleiter, R.; Hashmall, J.A.; Heilbronner, E.; Hornung, V.,
Interaction between the orbitals of lone pair electrons in dicarbonyl compounds,
Angew. Chem. Int. Ed. Engl., 1971, 10, 401. [all data]
Burgers, Holmes, et al., 1983
Burgers, P.C.; Holmes, J.L.; Szulejko, J.E.; Mommers, A.A.; Terlouw, J.K.,
The gas phase ion chemistry of the acetyl cation and isomeric [C2H3O]+ ions. On the structure of the [C2H3O]+ daughter ions generated from the enol of acetone radical cation,
Org. Mass Spectrom., 1983, 18, 254. [all data]
Murad and Inghram, 1964
Murad, E.; Inghram, M.G.,
Thermodynamic properties of the acetyl radical and bond dissociation energies in aliphatic carbonyl compounds,
J. Chem. Phys., 1964, 41, 404. [all data]
Holmes and Lossing, 1984
Holmes, J.L.; Lossing, F.P.,
Heats of formation of organic radicals from appearance energies,
Int. J. Mass Spectrom. Ion Processes, 1984, 58, 113. [all data]
Tudor, 1997
Tudor, E.,
Temperature dependence of the retention index for perfumery compounds on a SE-30 glass capillary column. I. Linear equations,
J. Chromatogr. A, 1997, 779, 1-2, 287-297, https://doi.org/10.1016/S0021-9673(97)00453-6
. [all data]
Haken, Ho, et al., 1975
Haken, J.K.; Ho, D.K.M.; Vaughan, C.E.,
Gas chromatography of homologous esters. VII. The retention behaviour of pyruvate esters and related carbonyl and carboxyl compounds,
J. Chromatogr., 1975, 106, 2, 317-325, https://doi.org/10.1016/S0021-9673(00)93839-1
. [all data]
Reymond, Mueggler-Chavan, et al., 1966
Reymond, D.; Mueggler-Chavan, F.; Viani, R.; Vuataz, L.; Egli, R.H.,
Gas chromatographic analysis of steam volatile aroma constituents: application to coffee, tea and cocoa aromas,
J. Gas Chromatogr., 1966, 4, 1, 28-31, https://doi.org/10.1093/chromsci/4.1.28
. [all data]
Viani, Müggler-Chavan, et al., 1965
Viani, R.; Müggler-Chavan, F.; Reymond, D.; Egli, R.H.,
196. Sur la composition de l'arôme de café,
Helv. Chim. Acta, 1965, 48, 195-196, 1809-1815, https://doi.org/10.1002/hlca.19650480743
. [all data]
Takeoka, Flath, et al., 1990
Takeoka, G.R.; Flath, R.A.; Mon, T.R.; Teranishi, R.; Guentert, M.,
Volatile Constituents of Apricot (Prunus armeniaca),
J. Agric. Food Chem., 1990, 38, 2, 471-477, https://doi.org/10.1021/jf00092a031
. [all data]
Shibamoto, Kamiya, et al., 1981
Shibamoto, T.; Kamiya, Y.; Mihara, S.,
Isolation and identification of volatile compounds in cooked meat: sukiyaki,
J. Agric. Food Chem., 1981, 29, 1, 57-63, https://doi.org/10.1021/jf00103a015
. [all data]
Shimoda and Shibamoto, 1990
Shimoda, M.; Shibamoto, T.,
Isolation and identification of headspace volatiles from brewed coffee with an on-column GC/MS method,
J. Agric. Food Chem., 1990, 38, 3, 802-804, https://doi.org/10.1021/jf00093a045
. [all data]
Tatsuka, Suekane, et al., 1990
Tatsuka, K.; Suekane, S.; Sakai, Y.; Sumitani, H.,
Volatile constituents of kiwi fruit flowers: simultaneous distillation and extraction versus headspace sampling,
J. Agric. Food Chem., 1990, 38, 12, 2176-2180, https://doi.org/10.1021/jf00102a015
. [all data]
Nishimura, Yamaguchi, et al., 1989
Nishimura, O.; Yamaguchi, K.; Mihara, S.; Shibamoto, T.,
Volatile Constituents of Guava Fruits (Psidium guajava L.) and Canned Puree,
J. Agric. Food Chem., 1989, 37, 1, 139-142, https://doi.org/10.1021/jf00085a033
. [all data]
Umano, Shoji, et al., 1986
Umano, K.; Shoji, A.; Hagi, Y.; Shibamoto, T.,
Volatile constituents of peel of quince fruit, Cydonia oblonga Miller,
J. Agric. Food Chem., 1986, 34, 4, 593-596, https://doi.org/10.1021/jf00070a003
. [all data]
Galt and MacLeod, 1984
Galt, A.M.; MacLeod, G.,
Headspace sampling of cooked beef aroma using Tenax GC,
J. Agric. Food Chem., 1984, 32, 1, 59-64, https://doi.org/10.1021/jf00121a016
. [all data]
MacLeod and Pieris, 1983
MacLeod, A.J.; Pieris, N.M.,
Volatile components of papaya (Carica papaya L.) with particular reference to glucosinolate products,
J. Agric. Food Chem., 1983, 31, 5, 1005-1008, https://doi.org/10.1021/jf00119a021
. [all data]
Brander, Kepner, et al., 1980
Brander, C.F.; Kepner, R.E.; Webb, A.D.,
Identification of Some Volatile Compounds of Wine of Vitis Vinifera Cultivar Pinot Noir,
Am. J. Enol. Vitic, 1980, 31, 1, 69-75. [all data]
Engel and Ratel, 2007
Engel, E.; Ratel, J.,
Correction of the data generated by mass spectrometry analyses of biological tissues: Application to food authentication,
J. Chromatogr. A, 2007, 1154, 1-2, 331-341, https://doi.org/10.1016/j.chroma.2007.02.012
. [all data]
Lozano P.R., Drake M., et al., 2007
Lozano P.R.; Drake M.; Benitez D.; Cadwallader K.R.,
Instrumental and sensory characterization of heat-induced odorants in aseptically packaged soy milk,
J. Agric. Food Chem., 2007, 55, 8, 3018-3026, https://doi.org/10.1021/jf0631225
. [all data]
Lozano P.R., Miracle E.R., et al., 2007
Lozano P.R.; Miracle E.R.; Krause A.J.; Drake M.; Cadwallader K.R.,
Effect of cold storage and packaging material on the major aroma components of sweet cream butter,
J. Agric. Food Chem., 2007, 55, 19, 7840-7846, https://doi.org/10.1021/jf071075q
. [all data]
Elmore, Cooper, et al., 2005
Elmore, J.S.; Cooper, S.L.; Enser, M.; Mottram, D.S.; Sinclair, L.A.; Wilkinson, R.G.; Wood, J.D.,
Dietary manipulation of fatty acid composition in lamb meat and its effect on the volatile aroma compounds of grilled lamb,
Meat Sci., 2005, 69, 2, 233-242, https://doi.org/10.1016/j.meatsci.2004.07.002
. [all data]
Insausti, Goñi, et al., 2005
Insausti, K.; Goñi, V.; Petri, E.; Gorraiz, C.; Beriain, M.J.,
Effect of weight at slaughter on the volatile compounds of cooked beef from Spanish cattle breeds,
Meat Sci., 2005, 70, 1, 83-90, https://doi.org/10.1016/j.meatsci.2004.12.003
. [all data]
Mahattanatawee, Goodner, et al., 2005
Mahattanatawee, K.; Goodner, K.L.; Baldwin, E.A.,
Volatile constituents and character impact compounds of selected Florida's tropical fruit,
Proc. Fla. State Hort. Soc., 2005, 118, 414-418. [all data]
Avsar, Karagul-Yuceer, et al., 2004
Avsar, Y.K.; Karagul-Yuceer, Y.; Drake, M.A.; Singh, T.K.; Yoon, Y.; Cadwallader, K.R.,
Characterization of nutty flavor in cheddar cheese,
J. Dairy Sci., 2004, 87, 7, 1999-2010, https://doi.org/10.3168/jds.S0022-0302(04)70017-X
. [all data]
Hierro, de la Hoz, et al., 2004
Hierro, E.; de la Hoz, L.; Ordóñez, J.A.,
Headspace volatile compounds from salted and occasionally smoked dried meats (cecinas) as affected by animal species,
Food Chem., 2004, 85, 4, 649-657, https://doi.org/10.1016/j.foodchem.2003.07.001
. [all data]
Mahajan, Goddik, et al., 2004
Mahajan, S.S.; Goddik, L.; Qian, M.C.,
Aroma Compounds in Sweet Whey Powder,
J. Dairy Sci., 2004, 87, 12, 4057-4063, https://doi.org/10.3168/jds.S0022-0302(04)73547-X
. [all data]
Pino, Marbot, et al., 2004
Pino, J.A.; Marbot, R.; Vazquez, C.,
Volatile components of tamarind (Tamarindus indica L.) grown in Cuba,
J. Essent. Oil Res., 2004, 16, 4, 318-320, https://doi.org/10.1080/10412905.2004.9698731
. [all data]
Pino, Marbot, et al., 2004, 2
Pino, J.A.; Marbot, R.; Rosado, A.; Vázquez, C.,
Volatile constituents of Malay rose apple [Syzygium malaccense (L.) Merr. Perry],
Flavour Fragr. J., 2004, 19, 1, 32-35, https://doi.org/10.1002/ffj.1269
. [all data]
Siegmund and Murkovic, 2004
Siegmund, B.; Murkovic, M.,
Changes in chemical composition of pumpkin seeds during the roasting process for production of pumpkin seed oil (Part 2: volatile compounds),
Food Chem., 2004, 84, 3, 367-374, https://doi.org/10.1016/S0308-8146(03)00241-3
. [all data]
Peterson and Reineccius, 2003
Peterson, D.G.; Reineccius, G.A.,
Characterization of the volatile compounds that constitute fresh sweet cream butter aroma,
Flavour Fragr. J., 2003, 18, 3, 215-220, https://doi.org/10.1002/ffj.1192
. [all data]
Peterson and Reineccius, 2003, 2
Peterson, D.G.; Reineccius, G.A.,
Determination of the aroma impact compounds in heated sweet cream butter,
Flavour Fragr. J., 2003, 18, 4, 320-324, https://doi.org/10.1002/ffj.1228
. [all data]
Pino, Marbot, et al., 2003
Pino, J.; Marbot, R.; Rosado, A.; Vázquez, C.,
Volatile constituents of fruits of Garcinia dulcis Kurz. from Cuba,
Flavour Fragr. J., 2003, 18, 4, 271-274, https://doi.org/10.1002/ffj.1187
. [all data]
Duckham, Dodson, et al., 2002
Duckham, S.C.; Dodson, A.T.; Bakker, J.; Ames, J.M.,
Effect of cultivar and storage time on the volatile flavor components of baked potato,
J. Agric. Food Chem., 2002, 50, 20, 5640-5648, https://doi.org/10.1021/jf011326+
. [all data]
Karagül-Yüceer, Cadwallader, et al., 2002
Karagül-Yüceer, Y.; Cadwallader, K.R.; Drake, M.A.,
Volatile flavor components of stored nonfat dry milk,
J. Agric. Food Chem., 2002, 50, 2, 305-312, https://doi.org/10.1021/jf010648a
. [all data]
Pino, Marbot, et al., 2002
Pino, J.; Marbot, R.; Rosado, A.,
Volatile constituents of star apple (Chrysophyllum cainito L.) from Cuba,
Flavour Fragr. J., 2002, 17, 5, 401-403, https://doi.org/10.1002/ffj.1116
. [all data]
Wu and Cadwallader, 2002
Wu, Y.-F.G.; Cadwallader, K.R.,
Characterization of the aroma of a meatlike process flavoring from soybean-based enzyme-hydrolyzed vegetable protein,
J. Agric. Food Chem., 2002, 50, 10, 2900-2907, https://doi.org/10.1021/jf0114076
. [all data]
Zhou, Wintersteen, et al., 2002
Zhou, Q.; Wintersteen, C.L.; Cadwallader, K.R.,
Identification and quantification of aroma-active components that contribute to the distinct malty flavor of buckwheat honey,
J. Agric. Food Chem., 2002, 50, 7, 2016-2021, https://doi.org/10.1021/jf011436g
. [all data]
Baek, Kim, et al., 2001
Baek, H.H.; Kim, C.J.; Ahn, B.H.; Nam, H.S.; Cadwallader, K.R.,
Aroma extract dilution analysis of a beeflike process flavor from extruded enzyme-hydrolyzed soybean protein,
J. Agric. Food Chem., 2001, 49, 2, 790-793, https://doi.org/10.1021/jf000609j
. [all data]
Bruna, Hierro, et al., 2001
Bruna, J.M.; Hierro, E.M.; de la Hoz, L.; Mottram, D.S.; Fernández, M.; Ordóñez, J.A.,
The contribution of Penicillium aurantiogriseum to the volatile composition and sensory quality of dry fermented sausages,
Meat Sci., 2001, 59, 1, 97-107, https://doi.org/10.1016/S0309-1740(01)00058-4
. [all data]
Larráyoz, Addis, et al., 2001
Larráyoz, P.; Addis, M.; Gauch, R.; Bosset, J.O.,
Comparison of dynamic headspace and simultaneous distillation extraction techniques used for the analysis of the volatile components in three European PDO ewes milk cheeses,
Int. Dairy J., 2001, 11, 11-12, 911-926, https://doi.org/10.1016/S0958-6946(01)00144-3
. [all data]
Lee, Suriyaphan, et al., 2001
Lee, G.-H.; Suriyaphan, O.; Cadwallader, K.R.,
Aroma components of cooked tail meat of American lobster (Homarus americanus),
J. Agric. Food Chem., 2001, 49, 9, 4324-4332, https://doi.org/10.1021/jf001523t
. [all data]
Elmore, Mottram, et al., 2000
Elmore, J.S.; Mottram, D.S.; Hierro, E.,
Two-fibre solid-phase microextraction combined with gas chromatography-mass spectrometry for the analysis of volatile aroma compounds in cooked pork,
J. Chromatogr. A, 2000, 905, 1-2, 233-240, https://doi.org/10.1016/S0021-9673(00)00990-0
. [all data]
Chevance and Farmer, 1999
Chevance, F.F.V.; Farmer, L.J.,
Identification of major volatile odor compounds in frankfurters,
J. Agric. Food Chem., 1999, 47, 12, 5151-5160, https://doi.org/10.1021/jf990515d
. [all data]
Aaslyng, Elmore, et al., 1998
Aaslyng, M.D.; Elmore, J.S.; Mottram, D.S.,
Comparison of the aroma characteristics of acid-hydrolyzed and enzyme-hydrolyzed vegetable proteins produced from soy,
J. Agric. Food Chem., 1998, 46, 12, 5225-5231, https://doi.org/10.1021/jf9806816
. [all data]
Verdier-Metz., Coulon, et al., 1998
Verdier-Metz., I.; Coulon, J.-B.; PPradel, P.; Viallon, C.; Berdague, J.-L.,
Effect of forage conservation (hay or silage) and cow breed on the coagulation properties of milks and on the characteristics of ripened cheeses,
J. Dairy Res., 1998, 65, 1, 9-21, https://doi.org/10.1017/S0022029997002616
. [all data]
Milo and Reineccius, 1997
Milo, C.; Reineccius, G.A.,
Identification and quantification of potent odorants in regular-fat and low-fat mild cheddar cheese,
J. Agric. Food Chem., 1997, 45, 9, 3590-3594, https://doi.org/10.1021/jf970152m
. [all data]
Misharina, Golovnya, et al., 1992
Misharina, T.A.; Golovnya, R.V.; Artamonova, M.P.; Zhuravskaya, N.K.,
Identification of volatile components of a model system with meat aroma,
Zh. Anal. Khim., 1992, 47, 850-857. [all data]
Zhang, Dorjpalam, et al., 1992
Zhang, Y.; Dorjpalam, B.; Ho, C.-T.,
Contribution of peptides to volatile formation in the Maillard reaction of casein hydrolysate with glucose,
J. Agric. Food Chem., 1992, 40, 12, 2467-2471, https://doi.org/10.1021/jf00024a026
. [all data]
Misharina, Aerove, et al., 1991
Misharina, T.A.; Aerove, A.F.; Golovnya, R.E.; Kalugina, V.I.; Rogovskaya, L.V.; Vysotskaya, L.E.; Shevtsov, V.K.,
Identification of volatile components of an aromatizer with a chicken odor by chromatography-mass spectrometry and chromatography-fourier transform infrared spectroscopy,
J. Anal. Chem. USSR (Engl. Transl.), 1991, 8, 1187-1193. [all data]
Zhang and Ho, 1991
Zhang, Y.; Ho, C.-T.,
Formation of meatlike aroma compounds from thermal reaction of inosine 5'-monophosphate with cysteine and glutathione,
J. Agric. Food Chem., 1991, 39, 6, 1145-1148, https://doi.org/10.1021/jf00006a031
. [all data]
Zhang and Ho, 1991, 2
Zhang, Y.; Ho, C.-T.,
Comparison of the volatile compounds formed from the thermal reaction of glucose with cysteine and glutathione,
J. Agric. Food Chem., 1991, 39, 4, 760-763, https://doi.org/10.1021/jf00004a029
. [all data]
Majcher and Jelen, 2007
Majcher, M.A.; Jelen, H.H.,
Effect of Cysteine and Cystine Addition on Sensory Profile and Potent Odorants of Extruded Potato Snacks,
J. Agric. Food Chem., 2007, 55, 14, 5754-5760, https://doi.org/10.1021/jf0703147
. [all data]
Künzel, Breuer, et al., 2006
Künzel, H.; Breuer, K.; Mayer, F.; Sedlbauer, K.,
Luftqualität und Zufriedenheit - Verbesserung von Innenraumluftqualität und Nutzerzufriedenheit durch Materialgeruchsverbesserung,
WKSB : Zeitschrift fur Warmeschutz, Kalteschutz, Schallschutz, Brandschutz, 2006, 57, 49-57. [all data]
Schuh and Schieberle, 2006
Schuh, C.; Schieberle, P.,
Characterization of the Key Aroma Compounds in the Beverage Prepared from Darjeeling Black Tea: Quantitative Differences between Tea Leaves and Infusion,
J. Agric. Food Chem., 2006, 54, 3, 916-924, https://doi.org/10.1021/jf052495n
. [all data]
Varlet V., Knockaert C., et al., 2006
Varlet V.; Knockaert C.; Prost C.; Serot T.,
Comparison of odor-active volatile compounds of fresh and smoked salmon,
J. Agric. Food Chem., 2006, 54, 9, 3391-3401, https://doi.org/10.1021/jf053001p
. [all data]
Bonaiti, Irlinger, et al., 2005
Bonaiti, C.; Irlinger, F.; Spinnler, H.E.; Engel, E.,
An iterative sensory procedure to select odor-active associations in complex consortia of microorganisms: application to the construction of a cheese model,
J. Dairy Sci., 2005, 88, 5, 1671-1684, https://doi.org/10.3168/jds.S0022-0302(05)72839-3
. [all data]
Majcher and Jelén, 2005
Majcher, M.A.; Jelén, H.H.,
Identification of potent odorants formed during the preparation of extruded potato snacks,
J. Agric. Food Chem., 2005, 53, 16, 6432-6437, https://doi.org/10.1021/jf050412x
. [all data]
Klesk, Qian, et al., 2004
Klesk, K.; Qian, M.; Martin, R.R.,
Aroma extract dilution analysis of cv. meeker (Rubus idaeus L.) red raspberries from Oregon and Washington,
J. Agric. Food Chem., 2004, 52, 16, 5155-5161, https://doi.org/10.1021/jf0498721
. [all data]
Klesk and Qian, 2003
Klesk, K.; Qian, M.,
Aroma extract dilution analysis of Cv. Marion (Rubus spp. hyb) and Cv. Evergreen (R. Iaciniatus L.) blackberries,
J. Agric. Food Chem., 2003, 51, 11, 3436-3441, https://doi.org/10.1021/jf0262209
. [all data]
Klesk and Qian, 2003, 2
Klesk, K.; Qian, M.,
Preliminary aroma comparison of Marion (Rubus spp. hyb) and Evergreen (R. laciniatus L.) blackberries by dynamic headspace/OSME technique,
J. Food Sci., 2003, 68, 2, 697-700, https://doi.org/10.1111/j.1365-2621.2003.tb05734.x
. [all data]
Mayr, van Ruth, et al., 2003
Mayr, D.; van Ruth, S.; Märk, T.D.,
Evaluation of the influence of mastication on temporal aroma release of ripe and unripe bananas, using a model mouth system and gas chromatography-olfactometry,
Eur. Food Res. Technol., 2003, 217, 4, 291-295, https://doi.org/10.1007/s00217-003-0777-1
. [all data]
Place, Imhof, et al., 2003
Place, R.B.; Imhof, M.; Teuber, M.; Olivier Bosset, J.,
Distribution of the volatile (flavour) compounds in Raclette cheese produced with different staphylococci in the smear,
Mitt. Lebensmittelunters. Hyg., 2003, 94, 192-211. [all data]
Carrapiso, Ventanas, et al., 2002
Carrapiso, A.I.; Ventanas, J.; García, C.,
Characterization of the most odor-active compounds of Iberian ham headspace,
J. Agric. Food Chem., 2002, 50, 7, 1996-2000, https://doi.org/10.1021/jf011094e
. [all data]
Engel, Baty, et al., 2002
Engel, E.; Baty, C.; le Corre, D.; Souchon, I.; Martin, N.,
Flavor-active compounds potentially implicated in cooked cauliflower acceptance,
J. Agric. Food Chem., 2002, 50, 22, 6459-6467, https://doi.org/10.1021/jf025579u
. [all data]
Zehentbauer and Reineccius, 2002
Zehentbauer, G.; Reineccius, G.A.,
Determination of key aroma components of cheddar cheese using dynamic headspace dilution assay,
Flavour Fragr. J., 2002, 17, 4, 300-305, https://doi.org/10.1002/ffj.1102
. [all data]
Duckham, Dodson, et al., 2001
Duckham, S.C.; Dodson, A.T.; Bakker, J.; Ames, J.M.,
Volatile flavour components of baked potato flesh. A comparison of eleven potato cultivars,
Nahrung/Food, 2001, 45, 5, 317-323, https://doi.org/10.1002/1521-3803(20011001)45:5<317::AID-FOOD317>3.0.CO;2-4
. [all data]
Tairu, Hofmann, et al., 2000
Tairu, A.O.; Hofmann, T.; Schieberle, P.,
Studies on the key odorants formed by roasting of wild mango seeds (Irvingia gabonensis),
J. Agric. Food Chem., 2000, 48, 6, 2391-2394, https://doi.org/10.1021/jf990765u
. [all data]
Zimmermann and Schieberle, 2000
Zimmermann, M.; Schieberle, P.,
Important odorants of sweet bell pepper powder (Capsicum annuum cv. annuum): differences between samples of Hungarian and Morrocan origin,
Eur. Food Res. Technol., 2000, 211, 3, 175-180, https://doi.org/10.1007/s002170050019
. [all data]
Buettner and Schieberle, 1999
Buettner, A.; Schieberle, P.,
Characterization of the most odor-active volatiles in fresh, hand squeezed juice of grapefruit (Citrus paradise Macfayden),
J. Agric. Food Chem., 1999, 47, 12, 5189-5193, https://doi.org/10.1021/jf990071l
. [all data]
Mutti and Grosch, 1999
Mutti, B.; Grosch, W.,
Potent odorants of boiled potatoes,
Nahrung, 1999, 43, 5, 302-306, https://doi.org/10.1002/(SICI)1521-3803(19991001)43:5<302::AID-FOOD302>3.0.CO;2-8
. [all data]
Fickert and Schieberle, 1998
Fickert, B.; Schieberle, P.,
Identification of the key odorants in barley malt (caramalt) using GC/MS techniques and odour dilution analyses,
Nahrung, 1998, 42, 6, 371-375, https://doi.org/10.1002/(SICI)1521-3803(199812)42:06<371::AID-FOOD371>3.0.CO;2-V
. [all data]
Hofmann and Schieberle, 1998
Hofmann, T.; Schieberle, P.,
Flavor contribution and formation of the intense roast-smelling odorants 2-propionyl-1-pyrroline and 2-propionyltetrahydropyridine in Maillard-type reactions,
J. Agric. Food Chem., 1998, 46, 7, 2721-2726, https://doi.org/10.1021/jf971101s
. [all data]
Heiler and Schieberle, 1997
Heiler, C.; Schieberle, P.,
Quantitative instrumental and sensory studies on Aroma compounds contributing to a metallic flavour defect in buttermilk,
Int. Dairy J., 1997, 7, 10, 659-666, https://doi.org/10.1016/S0958-6946(97)00067-8
. [all data]
Kubícková and Grosch, 1997
Kubícková, J.; Grosch, W.,
Evaluation of potent odorants of camembert cheese by dilution and concentration techniques,
Int. Dairy J., 1997, 7, 1, 65-70, https://doi.org/10.1016/S0958-6946(96)00044-1
. [all data]
Münch, Hofmann, et al., 1997
Münch, P.; Hofmann, T.; Schieberle, P.,
Comparison of key odorants generated by thermal treatment of commercial and self-prepared yeast extracts: influence of the amino acid composition on odorant formation,
J. Agric. Food Chem., 1997, 45, 4, 1338-1344, https://doi.org/10.1021/jf960658p
. [all data]
Triqui and Reineccius, 1995
Triqui, R.; Reineccius, G.A.,
Changes in flavor profiles with ripening of anchovy (Engraulis encrasicholus),
J. Agric. Food Chem., 1995, 43, 7, 1883-1889, https://doi.org/10.1021/jf00055a024
. [all data]
Triqui and Reineccius, 1995, 2
Triqui, R.; Reineccius, G.A.,
Flavor development in the ripening of anchovy (Engraulis encrasicholus L.),
J. Agric. Food Chem., 1995, 43, 2, 453-458, https://doi.org/10.1021/jf00050a037
. [all data]
Maignial, Pibarot, et al., 1992
Maignial, L.; Pibarot, P.; Bonetti, G.; Chaintreau, A.; Marion, J.P.,
Simultaneous distillation-extraction under static vacuum: isolation of volatile compounds at room temperature,
J. Chromatogr., 1992, 606, 1, 87-94, https://doi.org/10.1016/0021-9673(92)85260-Z
. [all data]
Pozo-Bayon M.A., Ruiz-Rodriguez A., et al., 2007
Pozo-Bayon M.A.; Ruiz-Rodriguez A.; Pernin K.; Cayot N.,
Influence of eggs on the aroma composition of a sponge cake and on the aroma release in model studies on flavored sponge cakes,
J. Agric. Food Chem., 2007, 55, 4, 1418-1426, https://doi.org/10.1021/jf062203y
. [all data]
Gurbuz O., Rouseff J.M., et al., 2006
Gurbuz O.; Rouseff J.M.; Rouseff R.L.,
Comparison of aroma volatiles in commercial Merlot and Cabernet Sauvignon wines using gas chromatography - Olfactometry and gas chromatography - Mass spectrometry,
J. Agric. Food Chem., 2006, 54, 11, 3990-3996, https://doi.org/10.1021/jf053278p
. [all data]
Lopez-Galilea I., Fournier N., et al., 2006
Lopez-Galilea I.; Fournier N.; Cid C.; Guichard E.,
Changes in headspace volatile concentrations of coffee brews caused by the roasting process and the brewing procedure,
J. Agric. Food Chem., 2006, 54, 22, 8560-8566, https://doi.org/10.1021/jf061178t
. [all data]
Mahadevan and Farmer, 2006
Mahadevan, K.; Farmer, L.,
Key Odor Impact Compounds in Three Yeast Extract Pastes,
J. Agric. Food Chem., 2006, 54, 19, 7242-7250, https://doi.org/10.1021/jf061102x
. [all data]
Petka, Ferreira, et al., 2006
Petka, J.; Ferreira, V.; González-Viñas, M.A.; Cacho, J.,
Sensory and Chemical Characterization of the Aroma of a White Wine Made with Devín Grapes,
J. Agric. Food Chem., 2006, 54, 3, 909-915, https://doi.org/10.1021/jf0518397
. [all data]
Whetstine M.E.C., Drake M.A., et al., 2006
Whetstine M.E.C.; Drake M.A.; Nelson B.K.; Barbano D.M.,
Flavor profiles of full-fat and reduced-fat cheese and cheese fat made from aged cheddar with the fat removed using a novel process,
J. Dairy Res., 2006, 89, 2, 505-517, https://doi.org/10.3168/jds.S0022-0302(06)72113-0
. [all data]
Alasalvar, Taylor, et al., 2005
Alasalvar, C.; Taylor, K.D.A.; Shahidi, F.,
Comparison of volatiles of cultured and wild sea bream (Sparus aurata) during storage in ice by dynamic headspace analysis/gas chromatography-mass spectrometry,
J. Agric. Food Chem., 2005, 53, 7, 2616-2622, https://doi.org/10.1021/jf0483826
. [all data]
Carunchia Whetstine, Croissant, et al., 2005
Carunchia Whetstine, M.E.; Croissant, A.E.; Drake, M.A.,
Characterization of Dried Whey Protein Concentrate and Isolate Flavor,
J. Dairy Sci., 2005, 88, 11, 3826-3839, https://doi.org/10.3168/jds.S0022-0302(05)73068-X
. [all data]
Cros S., Lignot B., et al., 2005
Cros S.; Lignot B.; Bourseau P.; Jaouen P.,
Reverse osmosis for the production of aromatic concentrates from mussel cooking juices: a technical assessment,
Desalination, 2005, 180, 1-3, 263-269, https://doi.org/10.1016/j.desal.2005.01.008
. [all data]
Elmore, Nisyrios, et al., 2005
Elmore, J.S.; Nisyrios, I.; Mottram, D.S.,
Analysis of the headspace aroma compounds of walnuts (Juglans regia L.),
Flavour Fragr. J., 2005, 20, 5, 501-506, https://doi.org/10.1002/ffj.1477
. [all data]
Malliaa, Fernandez-Garcia, et al., 2005
Malliaa, S.; Fernandez-Garcia, E.; Bosset, J.O.,
Comparison of purge and trap and solid phase microextraction techniques for studying the volatile aroma compounds of three European PDO hard cheeses,
Int. Dairy J., 2005, 15, 6-9, 741-758, https://doi.org/10.1016/j.idairyj.2004.11.007
. [all data]
Whetstine, Cadwallader, et al., 2005
Whetstine, M.E.C.; Cadwallader, K.R.; Drake, M.A.,
Characterization of aroma compounds responsible for the rosy/floral flavor in cheddar cheese,
J. Agric. Food Chem., 2005, 53, 8, 3126-3132, https://doi.org/10.1021/jf048278o
. [all data]
Varming, Petersen, et al., 2004
Varming, C.; Petersen, M.A.; Poll, L.,
Comparison of isolation methods for the determination of important aroma compounds in black currant (Ribes nigrum L.) juice, using nasal impact frequency profiling,
J. Agric. Food Chem., 2004, 52, 6, 1647-1652, https://doi.org/10.1021/jf035133t
. [all data]
Pino, Almora, et al., 2003
Pino, J.; Almora, K.; Marbot, R.,
Volatile components of papaya (Carica papaya L., maradol variety) fruit,
Flavour Fragr. J., 2003, 18, 6, 492-496, https://doi.org/10.1002/ffj.1248
. [all data]
Kim T.H., Kim T.H., et al., 2002
Kim T.H.; Kim T.H.; Shin J.H.; Yu E.J.; Kim Y.S.; Lee H.J.,
Characteristics of aroma-active compounds in the pectin-elicited suspension culture of Zanthoxylum piperitum (prickly ash),
Biotechnology Letters, 2002, 24, 7, 551-556, https://doi.org/10.1023/A:1014812508441
. [all data]
Pino, Marbot, et al., 2002, 2
Pino, J.A.; Marbot, R.; Vázquez, C.,
Characterization of volatile in Cosa Rican Guava [Psidium friedrichsthalianum (Berg) Niedenzu] fruit,
J. Agric. Food Chem., 2002, 50, 21, 6023-6026, https://doi.org/10.1021/jf011456i
. [all data]
le Guen, Prost, et al., 2001
le Guen, S.; Prost, C.; Demaimay, M.,
Evaluation of the representativeness of the odor of cooked mussel extracts and the relationship between sensory descriptors and potent odorants,
J. Agric. Food Chem., 2001, 49, 3, 1321-1327, https://doi.org/10.1021/jf000781n
. [all data]
Kim, Shin, et al., 2001
Kim, T.H.; Shin, J.H.; Baek, H.H.; Lee, H.J.,
Volatile flavour compounds in suspension culture of Agastache rugosa Kuntze (Korean mint),
J. Sci. Food Agric., 2001, 81, 6, 569-575, https://doi.org/10.1002/jsfa.845
. [all data]
Liu, Yang, et al., 2001
Liu, T.-T.; Yang, T.-S.; Wu, C.-M.,
Changes of volatiles in soy sauce-stewed pork during cold storage and reheating,
J. Sci. Food Agric., 2001, 81, 15, 1547-1552, https://doi.org/10.1002/jsfa.978
. [all data]
Pino and Marbot, 2001
Pino, J.A.; Marbot, R.,
Volatile flavor constituents of acerola (Malpighia emarginata DC.) fruit,
J. Agric. Food Chem., 2001, 49, 12, 5880-5882, https://doi.org/10.1021/jf010270g
. [all data]
Serot, Prost, et al., 2001
Serot, T.; Prost, C.; Visan, L.; Burcea, M.,
Identification of the main odor-active compounds in musts from French and Romanian hybrids by three olfactometric methods,
J. Agric. Food Chem., 2001, 49, 4, 1909-1914, https://doi.org/10.1021/jf0012291
. [all data]
le Guen, Prost, et al., 2000
le Guen, S.; Prost, C.; Demaimay, M.,
Critical comparison of three olfactometric methods for the identification of the most potent odorants in cooked mussels (Mytilus edulis),
J. Agric. Food Chem., 2000, 48, 4, 1307-1314, https://doi.org/10.1021/jf990745s
. [all data]
Le Guen, Prost, et al., 2000
Le Guen, S.; Prost, C.; Demaimay, M.,
Characterization of odorant compounds of mussels (Mytilus edulis) according to their origin using gas chromatography-olfactometry and gas chromatography-mass spectrometry,
J. Chromatogr. A, 2000, 896, 1-2, 361-371, https://doi.org/10.1016/S0021-9673(00)00729-9
. [all data]
Chevance and Farmer, 1999, 2
Chevance, F.F.V.; Farmer, L.J.,
Release of volatile odor compounds from full-fat and reduced-fat frankfurters,
J. Agric. Food Chem., 1999, 47, 12, 5161-5168, https://doi.org/10.1021/jf9905166
. [all data]
Stephan and Steinhart, 1999
Stephan, A.; Steinhart, H.,
Identification of character impact odorants of different soybean lecithins,
J. Agric. Food Chem., 1999, 47, 7, 2854-2859, https://doi.org/10.1021/jf981387g
. [all data]
Cha and Cadwallader, 1998
Cha, Y.J.; Cadwallader, K.R.,
Aroma-active compounds in skipjack tuna sauce,
J. Agric. Food Chem., 1998, 46, 3, 1123-1128, https://doi.org/10.1021/jf970380g
. [all data]
Cha, Kim, et al., 1998
Cha, Y.J.; Kim, H.; Cadwallader, K.R.,
Aroma-active compounds in Kimchi during fermentation,
J. Agric. Food Chem., 1998, 46, 5, 1944-1953, https://doi.org/10.1021/jf9706991
. [all data]
Ott, Fay, et al., 1997
Ott, A.; Fay, L.B.; Chaintreau, A.,
Determination and origin of the aroma impact compounds of yogurt flavor,
J. Agric. Food Chem., 1997, 45, 3, 850-858, https://doi.org/10.1021/jf960508e
. [all data]
Cadwallader, Tan, et al., 1995
Cadwallader, K.R.; Tan, Q.; Chen, F.; Meyers, S.P.,
Evaluation of the aroma of cooked spiny lobster tail meat by aroma extract dilution analysis,
J. Agric. Food Chem., 1995, 43, 9, 2432-2437, https://doi.org/10.1021/jf00057a022
. [all data]
Shimoda, Shigematsu, et al., 1995
Shimoda, M.; Shigematsu, H.; Shiratsuchi, H.; Osajima, Y.,
Comparison of the odor concentrates by SDE and adsorptive column method from green tea infusion,
J. Agric. Food Chem., 1995, 43, 6, 1616-1620, https://doi.org/10.1021/jf00054a037
. [all data]
Shiratsuchi, Shimoda, et al., 1994
Shiratsuchi, H.; Shimoda, M.; Imayoshi, K.; Noda, K.; Osajima, Y.,
Volatile flavor compounds in spray-dried skim milk powder,
J. Agric. Food Chem., 1994, 42, 4, 984-988, https://doi.org/10.1021/jf00040a028
. [all data]
Chung and Cadwallader, 1993
Chung, H.Y.; Cadwallader, K.R.,
Volatile components in blue crab (Callinectes sapidus) meat and processing by-product,
J. Food Sci., 1993, 58, 6, 1203-1207, https://doi.org/10.1111/j.1365-2621.1993.tb06148.x
. [all data]
Tanchotikul and Hsieh, 1989
Tanchotikul, U.; Hsieh, T.C.-Y.,
Volatile Flavor Components in Crayfish Waste,
J. Food Sci., 1989, 54, 6, 1515-1520, https://doi.org/10.1111/j.1365-2621.1989.tb05149.x
. [all data]
Baltes and Mevissen, 1988
Baltes, W.; Mevissen, L.,
Model reactions on roast aroma formation. VI. Volatile reaction products from the reaction of phenylalanine with glucose during cooking and roasting,
Z. Lebensm. Unters. Forsch., 1988, 187, 3, 209-214, https://doi.org/10.1007/BF01043341
. [all data]
Vejaphan, Hsieh, et al., 1988
Vejaphan, W.; Hsieh, T.C.Y.; Williams, S.S.,
Volatile flavor components from boiled crayfish (Procambarus clarkii) tail meat,
J. Food Sci., 1988, 53, 6, 1666-1670, https://doi.org/10.1111/j.1365-2621.1988.tb07811.x
. [all data]
van den Dool and Kratz, 1963
van den Dool, H.; Kratz, P. Dec.,
A generalization of the retention index system including linear temperature programmed gas-liquid partition chromatography,
J. Chromatogr., 1963, 11, 463-471, https://doi.org/10.1016/S0021-9673(01)80947-X
. [all data]
Bianchi, Cantoni, et al., 2007
Bianchi, F.; Cantoni, C.; Careri, M.; Chiesa, L.; Musci, M.; Pinna, A.,
Characterization of the aromatic profile for the authentication and differentiation of typical Italian dry-sausages,
Talanta, 2007, 72, 4, 1552-1563, https://doi.org/10.1016/j.talanta.2007.02.019
. [all data]
Bianchi, Careri, et al., 2007
Bianchi, F.; Careri, M.; Mangia, A.; Musci, M.,
Retention indices in the analysis of food aroma volatile compounds in temperature-programmed gas chromatography: Database creation and evaluation of precision and robustness,
J. Sep. Sci., 2007, 39, 4, 563-572, https://doi.org/10.1002/jssc.200600393
. [all data]
Escudero, Campo, et al., 2007
Escudero, A.; Campo, E.; Fariña, L.; Cacho, J.; Ferreira, V.,
Analytical Characterization of the Aroma of Five Premium Red Wines. Insights into the Role of Odor Families and the Concept of Fruitiness of Wines,
J. Agric. Food Chem., 2007, 55, 11, 4501-4510, https://doi.org/10.1021/jf0636418
. [all data]
Campo, Ferreira, et al., 2005
Campo, E.; Ferreira, V.; Escudero, A.; Cacho, J.,
Prediction of the wine sensory properties related to grape variety from dynamic-headspace gas chromatography-olfactometry data,
J. Agric. Food Chem., 2005, 53, 14, 5682-5690, https://doi.org/10.1021/jf047870a
. [all data]
Hallier, Prost, et al., 2005
Hallier, A.; Prost, C.; Serot, T.,
Influence in rearing conditions on the volatile compounds of cooked fillets of Silurus glanis (European catfish),
J. Agric. Food Chem., 2005, 53, 18, 7204-7211, https://doi.org/10.1021/jf050559o
. [all data]
Ranau, Kleeberg, et al., 2005
Ranau, R.; Kleeberg, K.K.; Schlegelmilch, M.; Streese, J.; Stegmann, R.; Steinhart, H.,
Analytical determination of the suitability of different processes for the treatment of odorous waste gas,
Waste Management, 2005, 25, 9, 908-916, https://doi.org/10.1016/j.wasman.2005.07.004
. [all data]
Ranau and Steinhart, 2005
Ranau, R.; Steinhart, H.,
Identification and evaluation of volatile odor-active pollutants from different odor emission sources in the food industry,
Eur. Food Res. Technol., 2005, 220, 2, 226-231, https://doi.org/10.1007/s00217-004-1073-4
. [all data]
Wang, Finn, et al., 2005
Wang, Y.; Finn, C.; Qian, M.C.,
Impact of Growing Environment on Chickasaw Blackberry ( Rubus L.) Aroma Evaluated by Gas Chromatography Olfactometry Dilution Analysis,
J. Agric. Food Chem., 2005, 53, 9, 3563-3571, https://doi.org/10.1021/jf048102m
. [all data]
Ferrari, Lablanquie, et al., 2004
Ferrari, G.; Lablanquie, O.; Cantagrel, R.; Ledauphin, J.; Payot, T.; Fournier, N.; Guichard, E.,
Determination of key odorant compounds in freshly distilled cognac using GC-O, GC-MS, and sensory evaluation,
J. Agric. Food Chem., 2004, 52, 18, 5670-5676, https://doi.org/10.1021/jf049512d
. [all data]
Engel and Schieberle, 2002
Engel, W.; Schieberle, P.,
Identification and quantitation of key aroma compounds formed in Maillard-type reactions of fructose with cysteamine or isothiaproline (1,3-thiazolidine-2-carboxylic acid),
J. Agric. Food Chem., 2002, 50, 19, 5394-5399, https://doi.org/10.1021/jf0203186
. [all data]
Jezussek, Juliano, et al., 2002
Jezussek, M.; Juliano, B.O.; Schieberle, P.,
Comparison of key aroma compounds in cooked brown rice varieties based on aroma extract dilution analysis,
J. Agric. Food Chem., 2002, 50, 5, 1101-1105, https://doi.org/10.1021/jf0108720
. [all data]
Kirchhoff and Schieberle, 2002
Kirchhoff, E.; Schieberle, P.,
Quantitation of odor-active compounds in rye flour and rye sourdough using stable isotope dilution assays,
J. Agric. Food Chem., 2002, 50, 19, 5378-5385, https://doi.org/10.1021/jf020236h
. [all data]
Rhlid, Fleury, et al., 2002
Rhlid, R.B.; Fleury, Y.; Blank, I.; Fay, L.B.; Welti, D.H.; Vera, F.A.; Juillerat, M.A.,
Generation of roasted notes based on 2-acetyl-2-thiazoline and its precursor, 2-(1-hydroxyethyl)-4,5-dihydrothiazole, by combined bio and thermal approaches,
J. Agric. Food Chem., 2002, 50, 8, 2350-2355, https://doi.org/10.1021/jf011170d
. [all data]
Kirchhoff and Schieberle, 2001
Kirchhoff, E.; Schieberle, P.,
Determination of key aroma compounds in the crumb of a three-stage sourdough rye bread by stable isotope dilution assays and sensory studies,
J. Agric. Food Chem., 2001, 49, 9, 4304-4311, https://doi.org/10.1021/jf010376b
. [all data]
Munk, Johansen, et al., 2001
Munk, S.; Johansen, C.; Stahnke, L.H.; Adler-Nissen, J.,
Microbial survival and odor in laundry,
Journal of Surfactants and Detergents, 2001, 4, 4, 385-394, https://doi.org/10.1007/s11743-001-0192-2
. [all data]
Derail, Hofmann, et al., 1999
Derail, C.; Hofmann, T.; Schieberle, P.,
Differences in key odorants of handmade juice of yellow-flesh peaches (Prunus persica L.) induced by the workup procedure,
J. Agric. Food Chem., 1999, 47, 11, 4742-4745, https://doi.org/10.1021/jf990459g
. [all data]
Hinterholzer, Lemos, et al., 1998
Hinterholzer, A.; Lemos, T.; Schieberle, P.,
Identification of the key odorants in raw French beans and changes during cooking,
Z. Lebensm. Unters. Forsch. A, 1998, 207, 3, 219-222, https://doi.org/10.1007/s002170050322
. [all data]
Prost, Serot, et al., 1998
Prost, C.; Serot, T.; Demaimay, M.,
Identification of the most potent odorants in wild and farmed cooked turbot (Scophtalamus maximus L.),
J. Agric. Food Chem., 1998, 46, 8, 3214-3219, https://doi.org/10.1021/jf980128o
. [all data]
Baek and Cadwallader, 1996
Baek, H.H.; Cadwallader, K.R.,
Volatile compounds in flavor concentrates produced from crayfish-processing byproducts with and without protease treatment,
J. Agric. Food Chem., 1996, 44, 10, 3262-3267, https://doi.org/10.1021/jf960023q
. [all data]
Hofmann and Schieberle, 1995
Hofmann, T.; Schieberle, P.,
Evaluation of the key odorants in a thermally treated solution of ribose and cysteine by aroma extract dilution techniques,
J. Agric. Food Chem., 1995, 43, 8, 2187-2194, https://doi.org/10.1021/jf00056a042
. [all data]
Sing, Smadja, et al., 1992
Sing, A.S.C.; Smadja, J.; Brevard, H.; Maignial, L.; Chaintreau, A.; Marion, J.-P.,
Volatile constituents of faham (Jumellea fragrans (Thou.) Schltr.),
J. Agric. Food Chem., 1992, 40, 4, 642-646, https://doi.org/10.1021/jf00016a024
. [all data]
Whitfield, Shea, et al., 1981
Whitfield, F.B.; Shea, S.R.; Gillen, K.J.; Shaw, K.J.,
Volatile components from the roots of Acacia pulchella R.Br. and their effect on Phytophthora cinnamomi rands,
Aust. J. Bot., 1981, 29, 2, 195-208, https://doi.org/10.1071/BT9810195
. [all data]
Majcher, Lawrowski, et al., 2010
Majcher, M.; Lawrowski, P.; Jelen, H.,
Comparison of original and adulterated oscypek cheese based on volatile and sensory profiles,
Acta Sci. Pol. Technol. Aliment., 2010, 9, 3, 265-275. [all data]
Kim and Chung, 2009
Kim, J.-S.; Chung, H.Y.,
GC-MS analysis of the volatile components in dried boxthorn (Lycium chimensis) Fruit,
J. Korean Soc. Appl. Biol. Chem., 2009, 52, 5, 516-524, https://doi.org/10.3839/jksabc.2009.088
. [all data]
Laselan, Buettner, et al., 2009
Laselan, P.; Buettner, A.; Christlbauer, M.,
Investigation of the retronasal perseption of palm wine (Elaeis guineensis) aroma by application of sensory analysis and exhaled odorant measurement (EXOM),
African J. of Food, Agriculture, Nutrition and development, 2009, 9, 2, 793-813. [all data]
Risticevic, Carasek, et al., 2008
Risticevic, S.; Carasek, E.; Pawliszyn, J.,
Headspace solid-phase microextraction-gas chromatographic-time-of-flight mass spectrometric methodology for geographical origin verification of coffee,
Anal. Chim. Acta, 2008, 617, 1-2, 72-84, https://doi.org/10.1016/j.aca.2008.04.009
. [all data]
Berdague, Tournayre, et al., 2007
Berdague, J.L.; Tournayre, P.; Cambou, S.,
Novel multi-gas chromatography?olfactometry device and software for the identification of odour-active compounds,
J. Chromatogr. A, 2007, 1146, 1, 85-92, https://doi.org/10.1016/j.chroma.2006.12.102
. [all data]
Vasta, Ratel, et al., 2007
Vasta, V.; Ratel, J.; Engel, E.,
Mass Spectrometry Analysis of Volatile Compounds in Raw Meat for the Authentication of the Feeding Background of Farm Animals,
J. Agric. Food Chem., 2007, 55, 12, 4630-4639, https://doi.org/10.1021/jf063432n
. [all data]
Fadel, Mageed, et al., 2006
Fadel, H.H.M.; Mageed, M.A.A.; Lotfy, S.N.,
Quality and flavour stability of coffee substitute prepared by extrusion of wheat germ and chicory roots,
Amino Acids, 2006, https://doi.org/10.1007/s007260200008
. [all data]
Fadel, Mageed, et al., 2006, 2
Fadel, H.H.M.; Mageed, M.A.A.; Samad, A.K.M.E.A.; Lotfy, S.N.,
Cocoa substitute: Evaluation of sensory qualities and flavour stability,
Eur. Food Res. Technol., 2006, 223, 1, 125-131, https://doi.org/10.1007/s00217-005-0162-3
. [all data]
Leffingwell and Alford, 2005
Leffingwell, J.C.; Alford, E.D.,
Volatile constituents of Perique tobacco,
Electron. J. Environ. Agric. Food Chem., 2005, 4, 2, 899-915. [all data]
van Loon, Linssen, et al., 2005
van Loon, W.A.M.; Linssen, J.P.H.; Legger, A.; Posthumus, M.A.; Voragen, A.G.J.,
Identification and olfactometry of French fries flavour extracted at mouth conditions,
Food Chem., 2005, 90, 3, 417-425, https://doi.org/10.1016/j.foodchem.2004.05.005
. [all data]
Pino, Marbot, et al., 2005
Pino, J.A.; Marbot, R.; Rosado, A.; Vázquez, C.,
Volatile constituents of genipap (Genipa americana L.) fruit from Cuba,
Flavour Fragr. J., 2005, 20, 6, 583-586, https://doi.org/10.1002/ffj.1491
. [all data]
Ramírez, Estévez, et al., 2004
Ramírez, M.R.; Estévez, M.; Morcuende, D.; Cava, R.,
Effect of the type of frying culinary fat on volatile compounds isolated in fried pork loin chops by using SPME-GC-MS,
J. Agric. Food Chem., 2004, 52, 25, 7637-7643, https://doi.org/10.1021/jf049207s
. [all data]
Pino, Marbot, et al., 2003, 2
Pino, J.A.; Marbot, R.; Fuentes, V.,
Characterization of volatiles in Bullock's heart (Annona reticulata L.) fruit cultivars from Cuba,
J. Agric. Food Chem., 2003, 51, 13, 3836-3839, https://doi.org/10.1021/jf020733y
. [all data]
Sebastian, Viallon-Fernandez, et al., 2003
Sebastian, I.; Viallon-Fernandez, C.; Berge, P.; Berdague, J.-L.,
Analysis of the volatile fraction of lamb fat tissue: influence of the type of feeding,
Sciences des Aliments, 2003, 23, 4, 497-511, https://doi.org/10.3166/sda.23.497-511
. [all data]
Pino, Marbot, et al., 2002, 3
Pino, J.A.; Marbot, R.; Vazquez, C.,
Characterization of volatiles in Loquat fruit (Eriobotrya japonica Lindl.),
Revista CENIC Ciencias Quimicas, 2002, 33, 3, 115-119. [all data]
Sanz, Czerny, et al., 2002
Sanz, C.; Czerny, M.; Cid, C.; Schieberle, P.,
Comparison of potent odorants in a filtered coffee brew and in an instant coffee beverage by aroma extract dilution analysis (AEDA),
Eur. Food Res. Technol., 2002, 214, 4, 299-302, https://doi.org/10.1007/s00217-001-0459-9
. [all data]
Cadwallader and Heo, 2001
Cadwallader, K.R.; Heo, J.,
Aroma of roasted sesame oil: characterization by direct thermal desorption-gas chromatography-olfactometry and sample dilution analysis,
Am. Chem. Soc. Symp. Ser., 2001, 782, 187-202. [all data]
Joffraud, Leroi, et al., 2001
Joffraud, J.J.; Leroi, F.; Roy, C.; Berdagué, J.L.,
Characterisation of volatile compounds produced by bacteria isolated from the spoilage flora of cold-smoked salmon,
Int. J. Food Microbiol., 2001, 66, 3, 175-184, https://doi.org/10.1016/S0168-1605(00)00532-8
. [all data]
Kelling, 2001
Kelling, F.J.,
Olfaction in houseflies: morphology and electrophysiology. Chapter 7. Chemical and electrophysiological analysis of components, present in natural products that attract houseflies, Dissertation, University of Groningen, The Netherlands, 2001. [all data]
García, Martín, et al., 2000
García, C.; Martín, A.; Timón, M.L.; Córdoba, J.J.,
Microbial populations and volatile compounds in the 'bone taint' spoilage of dry cured ham,
Lett. Appl. Microbiol., 2000, 30, 1, 61-66, https://doi.org/10.1046/j.1472-765x.2000.00663.x
. [all data]
Kotseridis and Baumes, 2000
Kotseridis, Y.; Baumes, R.,
Identification of impact odorants in Bordeaux red grape juice, in the commercial yeast used for its fermentation, and in the produced wine,
J. Agric. Food Chem., 2000, 48, 2, 400-406, https://doi.org/10.1021/jf990565i
. [all data]
Tamura, Boonbumrung, et al., 2000
Tamura, H.; Boonbumrung, S.; Yoshizawa, T.; Varanyanond, W.,
Volatile components of the essential oil in the pulp of four yellow mangoes (Mangifera indica L.) in Thailand,
Food Sci. Technol. Res., 2000, 6, 1, 68-73, https://doi.org/10.3136/fstr.6.68
. [all data]
Buttery, Ling, et al., 1997
Buttery, R.G.; Ling, L.C.; Stern, D.J.,
Studies on popcorn aroma and flavor volatiles,
J. Agric. Food Chem., 1997, 45, 3, 837-843, https://doi.org/10.1021/jf9604807
. [all data]
Kondjoyan, Viallon, et al., 1997
Kondjoyan, N.; Viallon, C.; Berdagué, J.L.; Daridan, D.; Simon, M.-N.; Legault, C.,
Analyse comparative de la fraction volatile de jambons secs de porcs Gascon et Large-White x Landrace Français,
J. Rech. C.N.R.S., 1997, 29, 405-410, retrieved from http://www.rennes.inra.fr/srp/jrp/1997/97txtQualite/Q9704.pdf. [all data]
Milo and Grosch, 1996
Milo, C.; Grosch, W.,
Changes in the odorants of boiled salmon and cod as affected by the storage of the raw material,
J. Agric. Food Chem., 1996, 44, 8, 2366-2371, https://doi.org/10.1021/jf9507203
. [all data]
Roberts and Acree, 1996
Roberts, D.D.; Acree, T.E.,
Effects of heating and cream addition on fresh raspberry aroma using a retronasal aroma simulator and gas chromatography olfactometry,
J. Agric. Food Chem., 1996, 44, 12, 3919-3925, https://doi.org/10.1021/jf950701t
. [all data]
Wong and Lai, 1996
Wong, K.C.; Lai, F.Y.,
Volatile constituents from the fruits of four Syzygium species grown in Malaysia,
Flavour Fragr. J., 1996, 11, 1, 61-66, https://doi.org/10.1002/(SICI)1099-1026(199601)11:1<61::AID-FFJ539>3.0.CO;2-1
. [all data]
Buttery and Ling, 1995
Buttery, R.G.; Ling, L.C.,
Volatile flavor components of corn tortillas and related products,
J. Agric. Food Chem., 1995, 43, 7, 1878-1882, https://doi.org/10.1021/jf00055a023
. [all data]
Milo and Grosch, 1995
Milo, C.; Grosch, W.,
Detection of odor defects in boiled cod and trout by gas chromatography-olfactometry of headspace samples,
J. Agric. Food Chem., 1995, 43, 2, 459-462, https://doi.org/10.1021/jf00050a038
. [all data]
Buttery, Stern, et al., 1994
Buttery, R.G.; Stern, D.J.; Ling, L.C.,
Studies on flavor volatiles of some sweet corn products,
J. Agric. Food Chem., 1994, 42, 3, 791-795, https://doi.org/10.1021/jf00039a038
. [all data]
Roberts and Acree, 1994
Roberts, D.D.; Acree, T.E.,
Gas chromatography - olfactometry of glucose - proline Maillard reaction products
in American Chemical Society, Symposium Series -- Volume 543, American Chemical Society, Washington, 1994, 71-79. [all data]
Yu, Wu, et al., 1994
Yu, T.-H.; Wu, C.-M.; Ho, C.-T.,
Meat-like flavor generated from thermal interactions of glucose and alliin or deoxyalliin,
J. Agric. Food Chem., 1994, 42, 4, 1005-1009, https://doi.org/10.1021/jf00040a032
. [all data]
Lee, Macku, et al., 1991
Lee, S.-R.; Macku, C.; Shibamoto, T.,
Isolation and identification of headspace volatiles formed in heated butter,
J. Agric. Food Chem., 1991, 39, 11, 1972-1975, https://doi.org/10.1021/jf00011a017
. [all data]
Misharina, Golovnya, et al., 1991
Misharina, T.A.; Golovnya, R.V.; Charnomskii, V.V.,
Volatile components of boiled shrimp funchalia woodwardi and crab geryon maritae,
Zh. Anal. Khim., 1991, 46, 1421-1429. [all data]
Habu, Flath, et al., 1985
Habu, T.; Flath, R.A.; Mon, T.R.; Morton, J.F.,
Volatile components of Rooibos tea (Aspalathus linearis),
J. Agric. Food Chem., 1985, 33, 2, 249-254, https://doi.org/10.1021/jf00062a024
. [all data]
del Rosario, de Lumen, et al., 1984
del Rosario, R.; de Lumen, B.O.; Habu, T.; Flath, R.A.; Mon, T.R.; Teranishi, R.,
Comparison of headspace volatiles from winged beans and soybeans,
J. Agric. Food Chem., 1984, 32, 5, 1011-1015, https://doi.org/10.1021/jf00125a015
. [all data]
Labropoulos, Palmer, et al., 1982
Labropoulos, A.E.; Palmer, J.K.; Tao, P.,
Flavor evaluation and characterization of yogurt as affected by ultra-high temperature and vat processes,
J. Dairy Sci., 1982, 65, 2, 191-196, https://doi.org/10.3168/jds.S0022-0302(82)82176-0
. [all data]
Fang, Pu, et al., 2012
Fang, S.; Pu, B.; Chen, A.; Kangzhou, Ao; Xu, D.,
A box-behnken design for characterizing Chineser truffles (Tuber indicum) aroma by HS-SPME-GC-MS,
J. Food Res., 2012, 1, 3, 219-229, https://doi.org/10.5539/jfr.v1n3p219
. [all data]
San-Juan, Petka, et al., 2010
San-Juan, F.; Petka, J.; Cacho, J.; Ferreira, V.; Escudero, A.,
Producing headspace extracts for the gas chromatography - olphactometric evaluation of wine aroma,
Food Chemistry, 2010, 123, 1, 188-195, https://doi.org/10.1016/j.foodchem.2010.03.129
. [all data]
Breme, Langle, et al., 2008
Breme, K.; Langle, S.; Fernandez, X.; Meierhenrich, U.J.; Brevard, H.; Joulain, D.,
Character impact odorants from Brassicaceae by aroma extracts dilution analysis (AEDA): Brassica cretica and Brassica insularis,
Flavour Fragr. J., 2008, 24, 2, 88-93, https://doi.org/10.1002/ffj.1912
. [all data]
Chen, 2008
Chen, H.-F.,
Quantitative prediction of gas chromatography retention indices with support vector machines, radial basis neutral networks and multiple linear regression,
Anal. Chim. Acta, 2008, 609, 1, 24-36, https://doi.org/10.1016/j.aca.2008.01.003
. [all data]
Collin, Nizet, et al., 2008
Collin, S.; Nizet, S.; Muls, S.; Iraqi, R.; Bouseta, A.,
Characterization of odor-active compounds in extracts obtained by simultaneous extraction/distillation from Moroccan black olives,
J. Agric. Food Chem., 2008, 56, 9, 3273-3278, https://doi.org/10.1021/jf073488x
. [all data]
Buettner, 2007
Buettner, A.,
A selective and sensitive approach to characterize odour-active and volatile constituents in small-scale human milk samples,
Flavour Fragr. J., 2007, 22, 6, 465-473, https://doi.org/10.1002/ffj.1822
. [all data]
Cajka, Hajslova, et al., 2007
Cajka, T.; Hajslova, J.; Cochran, J.; Holadova, K.; Klimankova, E.,
Solid phase microextraction - comprehensive two dimensional gas chromatography - time-of-flight mass spectrometry for the analysis of honey volatiles,
J. Sep. Sci., 2007, 30, 4, 534-546, https://doi.org/10.1002/jssc.200600413
. [all data]
Carrapiso and Garsia, 2007
Carrapiso, A.I.; Garsia, C.,
Effect of sampling conditions on the odour-active compounds of iberian ham,
Cienc. Technol. Aliment., 2007, 5, 4, 287-290, https://doi.org/10.1080/11358120709487703
. [all data]
Lasekan, Buettner, et al., 2007
Lasekan, O.; Buettner, A.; Christlbauer, M.,
Investigation of important odorants of palm wine (Elaeis guineensis),
Food Chem., 2007, 105, 1, 15-23, https://doi.org/10.1016/j.foodchem.2006.12.052
. [all data]
Mallia, Escher, et al., 2007
Mallia, S.; Escher, F.; Rehberger, B.; Schlichtherle-Cerny, H.,
Aroma-active secondary oxidation products of butter, 3rd QLIF Congress, Hohenheim, Germany, March 20-23, 2007, 2007, retrieved from http://orgprints.org/view/projects/intconfqlif2007.html; http://orgprints.org/9734/. [all data]
Senger-Emonnot, Rochard, et al., 2006
Senger-Emonnot, P.; Rochard, S.; Pellegrin, F.; George, G.; Fernandez, X.; Lizzani-Cuvelier, L.,
Odour active aroma compounds of sea fig (Microcosmus sulcatus),
Food Chem., 2006, 97, 3, 465-471, https://doi.org/10.1016/j.foodchem.2005.05.026
. [all data]
Duflos, Moine, et al., 2005
Duflos, G.; Moine, F.; Coin, V.M.; Malle, P.,
Determination of volatile compounds in whiting (Merlangius merlangus) using headspace-solid-phase microextraction-gas chromatography-mass spectrometry,
J. Chromatogr. Sci., 2005, 43, 6, 304-312, https://doi.org/10.1093/chromsci/43.6.304
. [all data]
Hadorn, Eberhard, et al., 2005
Hadorn, R.; Eberhard, P.; Guggisberg, D.; Piccinali, P.; Schlichtherle-Cerny, H.,
An alternative surface culture for salami
in 51st International Congress of Meat Science and Technology, August 7-12, 2005, Baltimore, MD USA, 2005, 1041-1045. [all data]
Pino, Marbot, et al., 2005, 2
Pino, J.A.; Marbot, R.; Rosado, A.; Vázquez, C.,
Volatile constituents of Malay rose apple [Syzygium malaccense (L.) Merr. Perry],
Flavour Fragr. J., 2005, 20, 98-100. [all data]
Thierry, Maillard, et al., 2005
Thierry, A.; Maillard, M.-B.; Bonnarme, P.; Roussel, E.,
The addition of Propionibacterium freudenreichii to raclette cheese induces biochemical changes and enhances flavor development,
J. Agric. Food Chem., 2005, 53, 10, 4157-4165, https://doi.org/10.1021/jf0481195
. [all data]
Machiels, Istasse, et al., 2004
Machiels, D.; Istasse, L.; van Ruth, S.M.,
Gas chromatography-olfactometry analysis of beef meat originating from differently fed Belgian Blue, Limousin and Aberdeen Angus bulls,
Food Chem., 2004, 86, 3, 377-383, https://doi.org/10.1016/j.foodchem.2003.09.011
. [all data]
Vinogradov, 2004
Vinogradov, B.A.,
Production, composition, properties and application of essential oils, 2004, retrieved from http://viness.narod.ru. [all data]
Machiels and Istasse, 2003
Machiels, D.; Istasse, L.,
Evaluation of two commercial solid-phase microextraction fibres for the analysis of target aroma compounds in cooked beef meat,
Talanta, 2003, 61, 4, 529-537, https://doi.org/10.1016/S0039-9140(03)00319-9
. [all data]
Martí, Mestres, et al., 2003
Martí, M.P.; Mestres, M.; Sala, C.; Busto, O.; Guasch, J.,
Solid-phase microextraction and gas chromatography olfactometry analysis of successively diluted samples. A new approach of the aroma extract dilution analysis applied to the characterization of wine aroma,
J. Agric. Food Chem., 2003, 51, 27, 7861-7865, https://doi.org/10.1021/jf0345604
. [all data]
Qian and Reineccius, 2003
Qian, M.; Reineccius, G.,
Potent aroma compounds in Parmigiano Reggiano cheese studied using a dynamic headspace (purge-trap) method,
Flavour Fragr. J., 2003, 18, 3, 252-259, https://doi.org/10.1002/ffj.1194
. [all data]
Young, Lane, et al., 2003
Young, O.A.; Lane, G.A.; Priolo, A.; Fraser, K.,
Pastoral and species flavour in lambs raised on pasture, lucerne or maize,
J. Sci. Food Agric., 2003, 83, 2, 93-104, https://doi.org/10.1002/jsfa.1282
. [all data]
Bücking and Steinhart, 2002
Bücking, M.; Steinhart, H.,
Headspace GC and sensory analysis characterization of the influence of different milk additives on the flavor release of coffee beverages,
J. Agric. Food Chem., 2002, 50, 6, 1529-1534, https://doi.org/10.1021/jf011117p
. [all data]
Counet, Callemien, et al., 2002
Counet, C.; Callemien, D.; Ouwerx, C.; Collin, S.,
Use of gas chromatography-olfactometry to identify key odorant compounds in dark chocolate. Comparison of samples before and after conching,
J. Agric. Food Chem., 2002, 50, 8, 2385-2391, https://doi.org/10.1021/jf0114177
. [all data]
Ferreira, Ortín, et al., 2002
Ferreira, V.; Ortín, N.; Escudero, A.; López, R.; Cacho, J.,
Chemical characterization of the aroma of grenache Rosé wines: aroma extract dilution analysis, quantitative determination, and sensory reconstitution studies,
J. Agric. Food Chem., 2002, 50, 14, 4048-4054, https://doi.org/10.1021/jf0115645
. [all data]
Poligne, Collignan, et al., 2002
Poligne, I.; Collignan, A.; Trystram, G.,
Effects of salting, drying, cooking, and smoking operations on volatile compound formation and collor patterns in pork,
Food Eng. Physical Properties, 2002, 67, 8, 2976-2986. [all data]
van Ruth, Grossmann, et al., 2001
van Ruth, S.M.; Grossmann, I.; Geary, M.; Delahunty, C.M.,
Interactions between artificial saliva and 20 aroma compounds in water and oil model systems,
J. Agric. Food Chem., 2001, 49, 5, 2409-2413, https://doi.org/10.1021/jf001510f
. [all data]
Young and Baumeister, 1999
Young, O.A.; Baumeister, B.M.B.,
The effect of diet on the flavour of cooked beef and the odour compounds in beef fat,
N.Z. J. Agric. Res., 1999, 42, 3, 297-304, https://doi.org/10.1080/00288233.1999.9513379
. [all data]
Masanetz, Guth, et al., 1998
Masanetz, C.; Guth, H.; Grosch, W.,
Fishy and hay-like off-flavours of dry spinach,
Z. Lebensm. Unters. Forsch. A, 1998, 206, 2, 108-113, https://doi.org/10.1007/s002170050224
. [all data]
Zehentbauer and Grosch, 1998
Zehentbauer, G.; Grosch, W.,
Crust aroma of baguettes. I. Key odorants of baguettes prepared in two different ways,
J. Cereal Science, 1998, 28, 1, 81-92, https://doi.org/10.1006/jcrs.1998.0184
. [all data]
Flanagan, Streete, et al., 1997
Flanagan, R.J.; Streete, P.J.; Ramsey, J.D.,
Volatile Substance Abuse, UNODC Technical Series, No 5, United Nations, Office on Drugs and Crime, Vienna International Centre, PO Box 500, A-1400 Vienna, Austria, 1997, 56, retrieved from http://www.odccp.org/pdf/technicalseries1997-01-011.pdf. [all data]
Guth, 1997
Guth, H.,
Identification of character impact odorants of different white wine varieties,
J. Agric. Food Chem., 1997, 45, 8, 3022-3026, https://doi.org/10.1021/jf9608433
. [all data]
Schermann and Schieberle, 1997
Schermann, P.; Schieberle, P.,
Evaluation of key odorants in milk chocolate and cocoa mass by aroma extract dilution analyses,
J. Agric. Food Chem., 1997, 45, 3, 867-872, https://doi.org/10.1021/jf960670h
. [all data]
Mateo and Zumalacárregui, 1996
Mateo, J.; Zumalacárregui, J.M.,
Volatile compounds in chorizo and their changes during ripening,
Meat Sci., 1996, 44, 4, 255-273, https://doi.org/10.1016/S0309-1740(96)00028-9
. [all data]
Misharina, 1995
Misharina, T.A.,
Sorption regularities of sulfur- and oxygen-containing compounds in chromatography and their application in identification of volatile organic compounds, Diss. degree of Dr. Sci. (Chemistry), 1995, 52. [all data]
Milo and Grosch, 1993
Milo, C.; Grosch, W.,
Changes in the odorants of boiled trout (Salmo fario) as affected by the storage of the raw material,
J. Agric. Food Chem., 1993, 41, 11, 2076-2081, https://doi.org/10.1021/jf00035a048
. [all data]
Blank, Sen, et al., 1992
Blank, I.; Sen, A.; Grosch, W.,
Potent odorants of the roasted powder and brew of Arabica coffee,
Z. Lebensm. Unters Forsch., 1992, 195, 3, 239-245, https://doi.org/10.1007/BF01202802
. [all data]
Strete, Ruprah, et al., 1992
Strete, P.J.; Ruprah, M.; Ramsey, J.D.; Flanagan, R.J.,
Detection and identification of volatile substances by headspace capillary gas chromatography to aid the diagnosis of acute poisoning,
Analyst, 1992, 117, 7, 1111-1127, https://doi.org/10.1039/an9921701111
. [all data]
Takeoka, Flath, et al., 1988
Takeoka, G.R.; Flath, R.A.; Güntert, M.; Jennings, W.,
Nectarine volatiles: vacuum steam distillation versus headspace sampling,
J. Agric. Food Chem., 1988, 36, 3, 553-560, https://doi.org/10.1021/jf00081a037
. [all data]
Shibamoto, 1987
Shibamoto, T.,
Retention Indices in Essential Oil Analysis
in Capillary Gas Chromatography in Essential Oil Analysis, Sandra, P.; Bicchi, C., ed(s)., Hutchig Verlag, Heidelberg, New York, 1987, 259-274. [all data]
Waggott and Davies, 1984
Waggott, A.; Davies, I.W.,
Identification of organic pollutants using linear temperature programmed retention indices (LTPRIs) - Part II, 1984, retrieved from http://dwi.defra.gov.uk/research/completed-research/reports/dwi0383.pdf. [all data]
Heydanek and McGorrin, 1981
Heydanek, M.G.; McGorrin, R.J.,
Gas chromatography-mass spectroscopy investigations on the flavor chemistry of oat groats,
J. Agric. Food Chem., 1981, 29, 5, 950-954, https://doi.org/10.1021/jf00107a016
. [all data]
Budryn, Nebesny, et al., 2011
Budryn, G.; Nebesny, E.; Kula, J.; Majda, T.; Krysiak, W.,
HS-SPME/GC/MS Profiles of convectively and microwave roasted Ivory Coast Robusta coffee brews,
Czech. J. Food Sci., 2011, 29, 2, 151-160. [all data]
Onishi, Inoue, et al., 2011
Onishi, M.; Inoue, M.; Araki, T.; Iwabuchi, H.; Sagara, Y.,
Odorant transfer characteristics of white bread during baking,
Biosci Biotechnol. Biochem., 2011, 75, 2, 261-267, https://doi.org/10.1271/bbb.100572
. [all data]
Chen, Song, et al., 2009
Chen, G.; Song, H.; Ma, C.,
Aroma-active aompounds of Beijing roast duck,
Flavour Fragr. J., 2009, 24, 4, 186-191, https://doi.org/10.1002/ffj.1932
. [all data]
Mo, Fan, et al., 2009
Mo, X.; Fan, W.; Xu, Y.,
Changes in volatile compounds of Chinese rice wine wheat qu during fermentation and storage,
J. of the Institute of Brewing, 2009, 115, 4, 300-307, https://doi.org/10.1002/j.2050-0416.2009.tb00385.x
. [all data]
Rochat, Egger, et al., 2009
Rochat, S.; Egger, J.; Chaintreau, A.,
Strategy for the identification of key odorants: application to shrimp aroma,
J. Chromatogr. A, 2009, 1216, 36, 6424-6432, https://doi.org/10.1016/j.chroma.2009.07.014
. [all data]
Callejon, Morales, et al., 2008
Callejon, R.M.; Morales, M.L.; Ferreira, A.C.S.; Troncoso, A.M.,
Defining the typical aroma of sherry vinegar: sensory and chemical approach,
J. Agric. Food Chem., 2008, 56, 17, 8086-8095, https://doi.org/10.1021/jf800903n
. [all data]
Ganeko, Shoda, et al., 2008
Ganeko, N.; Shoda, M.; Hirohara, I.; Bhadra, A.; Ishida, T.; Matsuda, H.; Takamura, H.; Matoba, T.,
Analysis of volatile flavor compounds of sardine (Sardinops melanostica) by solid phase microextraction,
J. Food Sci., 2008, 73, 1, s83-s88, https://doi.org/10.1111/j.1750-3841.2007.00608.x
. [all data]
Marin, Pozrl, et al., 2008
Marin, K.; Pozrl, T.; Zlatic, E.; Plestenjak, A.,
A new aroma index to determine the aroma quality of roasted and ground coffee during storage,
Food Technol. Biotechnol., 2008, 46, 4, 442-447. [all data]
Nebesny, Budryn, et al., 2007
Nebesny, E.; Budryn, G.; Kula, J.; Majda, T.,
The effect of roasting method on headspace composition of robusta coffee bean aroma,
Eur. Food Res. Technol., 2007, 225, 1, 9-19, https://doi.org/10.1007/s00217-006-0375-0
. [all data]
Povolo, Contarini, et al., 2007
Povolo, M.; Contarini, G.; Mele, M.; Secchiari, P.,
Study on the influence of pasture on volatile fraction of Ewes' dairy products by solid-phase microextraction and gas chromatography-mass spectrometry,
J. Dairy Sci., 2007, 90, 2, 556-569, https://doi.org/10.3168/jds.S0022-0302(07)71539-4
. [all data]
Kishimoto, Wanikawa, et al., 2006
Kishimoto, T.; Wanikawa, A.; Kono, K.; Shibata, K.,
Comparison of the Odor-Active Compounds in Unhopped Beer and Beers Hopped with Different Hop Varieties,
J. Agric. Food Chem., 2006, 54, 23, 8855-8861, https://doi.org/10.1021/jf061342c
. [all data]
Spadone, Matthey-Doret, et al., 2006
Spadone, J.-C.; Matthey-Doret, W.; Blank, I.,
Formation of methyl(methylthio)methyl disulfide in broccoli (Brassica oleracea (L.) var. italica)
in Flavour Science: Recent Advances and Trends, Bredie, W.L.P.; Petersen, M.A., ed(s)., Elsevier, Amsterdam, 2006, 309-314. [all data]
de la Fuente, Martinez-Castro, et al., 2005
de la Fuente, E.; Martinez-Castro, I.; Sanz, J.,
Characterization of Spanish unifloral honeys by solid phase microextraction and gas chromatography-mass spectrometry,
J. Sep. Sci., 2005, 28, 9-10, 1093-1100, https://doi.org/10.1002/jssc.200500018
. [all data]
Rochat and Chaintreau, 2005
Rochat, S.; Chaintreau, A.,
Carbonyl Odorants Contributing to the In-Oven Roast Beef Top Note,
J. Agric. Food Chem., 2005, 53, 24, 9578-9585, https://doi.org/10.1021/jf058089l
. [all data]
Culleré, Escudero, et al., 2004
Culleré, L.; Escudero, A.; Cacho, J.; Ferreira, V.,
Gas chromatography-olfactometry and chemical quantitative study of the aroma of six premium auality Spanish aged red wines,
J. Agric. Food Chem., 2004, 52, 6, 1653-1660, https://doi.org/10.1021/jf0350820
. [all data]
Ishikawa, Ito, et al., 2004
Ishikawa, M.; Ito, O.; Ishizaki, S.; Kurobayashi, Y.; Fujita, A.,
Solid-phase aroma concentrate extraction (SPACE ): a new headspace technique for more sensitive analysis of volatiles,
Flavour Fragr. J., 2004, 19, 3, 183-187, https://doi.org/10.1002/ffj.1322
. [all data]
Soria, Gonzalez, et al., 2004
Soria, A.C.; Gonzalez, M.; de Lorenzo, C.; Martinez-Castro, I.; Sanza, J.,
Characterization of artisanal honeys from Madrid (Central Spain) on the basis of their melissopalynological, physicochemical and volatile composition data,
Food Chem., 2004, 85, 1, 121-130, https://doi.org/10.1016/j.foodchem.2003.06.012
. [all data]
Andueza, Maeztu, et al., 2003
Andueza, S.; Maeztu, L.; Pascual, L.; Ibanez, C.; de Pena M.P.; Cid, C.,
Influence of extraction temperature on the final quality of espresso coffee,
J. Sci. Food Agric., 2003, 83, 3, 240-248, https://doi.org/10.1002/jsfa.1304
. [all data]
Andueza, de Peña, et al., 2003
Andueza, S.; de Peña, M.P.; Cid, C.,
Chemical and sensorial characteristics of espresso coffee as affected by grinding and torrefacto roast,
J. Agric. Food Chem., 2003, 51, 24, 7034-7039, https://doi.org/10.1021/jf034628f
. [all data]
Tanaka, Yamauchi, et al., 2003
Tanaka, T.; Yamauchi, T.; Katsumata, R.; Kiuchi, K.,
Comparison of volatile components in commercial Itohiki-Natto by solid phase microextraction and gas chromatography,
Nippon Shokuhin Kagaku Kogaku Kaishi, 2003, 50, 6, 278-285, https://doi.org/10.3136/nskkk.50.278
. [all data]
Kumazawa and Masuda, 2002
Kumazawa, K.; Masuda, H.,
Identification of potent odorants in different green tea varieties using flavor dilution technique,
J. Agric. Food Chem., 2002, 50, 20, 5660-5663, https://doi.org/10.1021/jf020498j
. [all data]
Lecanu, Ducruet, et al., 2002
Lecanu, L.; Ducruet, V.; Jouquand, C.; Gratadoux, J.J.; Feigenbaum, A.,
Optimization of headspace solid-phase microextraction (SPME) for the odor analysis of surface-ripened cheese,
J. Agric. Food Chem., 2002, 50, 13, 3810-3817, https://doi.org/10.1021/jf0117107
. [all data]
Sanz, Maeztu, et al., 2002
Sanz, C.; Maeztu, L.; Zapelena, M.J.; Bello, J.; Cid, C.,
Profiles of volatile compounds and sensory analysis of three blends of coffee: influence of different proportions of Arabica and Robusta and influence of roasting coffee with sugar,
J. Sci. Food Agric., 2002, 82, 8, 840-847, https://doi.org/10.1002/jsfa.1110
. [all data]
Bendall, 2001
Bendall, J.G.,
Aroma compounds of fresh milk from New Zealand cows fed different diets,
J. Agric. Food Chem., 2001, 49, 10, 4825-4832, https://doi.org/10.1021/jf010334n
. [all data]
Ferreira, Aznar, et al., 2001
Ferreira, V.; Aznar, M.; López, R.; Cacho, J.,
Quantitative gas chromatography-olfactometry carried out at different dilutions of an extract. Differences in the odor profiles of four high-quality spanish aged red wines,
J. Agric. Food Chem., 2001, 49, 10, 4818-4824, https://doi.org/10.1021/jf010283u
. [all data]
Maeztu, Sanz, et al., 2001
Maeztu, L.; Sanz, C.; Andueza, S.; de Peña, M.P.; Bello, J.; Cid, C.,
Characterization of espresso coffee aroma by static headspace GC-MS and sensory flavor profile,
J. Agric. Food Chem., 2001, 49, 11, 5437-5444, https://doi.org/10.1021/jf0107959
. [all data]
Sanz, Ansorena, et al., 2001
Sanz, C.; Ansorena, D.; Bello, J.; Cid, C.,
Optimizing headspace temperature and time sampling for identification of volatile compounds in ground roasted Arabica coffee,
J. Agric. Food Chem., 2001, 49, 3, 1364-1369, https://doi.org/10.1021/jf001100r
. [all data]
Kim, Baek, et al., 2000
Kim, D.S.; Baek, H.H.; Ahn, C.B.; Byun, D.S.; Jung, K.J.; Lee, H.G.; Cadwallader, K.R.; Kim, H.R.,
Development and characterization of a flavoring agent from oyster cooker effluent,
J. Agric. Food Chem., 2000, 48, 10, 4839-4843, https://doi.org/10.1021/jf991096n
. [all data]
Umano, Hagi, et al., 2000
Umano, K.; Hagi, Y.; Nakahara, K.; Shoji, A.; Shibamoto, T.,
Volatile chemicals identified in extracts from leaves of Japanese mugwort (Artemisia princeps Pamp.),
J. Agric. Food Chem., 2000, 48, 8, 3463-3469, https://doi.org/10.1021/jf0001738
. [all data]
Kumazawa and Masuda, 1999
Kumazawa, K.; Masuda, H.,
Identification of potent odorants in Japanese green tea (Sen-cha),
J. Agric. Food Chem., 1999, 47, 12, 5169-5172, https://doi.org/10.1021/jf9906782
. [all data]
Lopez, Ferreira, et al., 1999
Lopez, R.; Ferreira, V.; Hernandez, P.; Cacho, J.F.,
Identification of impact odorants of young red wines made with Merlot, Cabernet Sauvignon and Grenache grape varieties: a comparative study,
J. Sci. Food Agric., 1999, 79, 11, 1461-1467, https://doi.org/10.1002/(SICI)1097-0010(199908)79:11<1461::AID-JSFA388>3.0.CO;2-K
. [all data]
Schlüter, Steinhart, et al., 1999
Schlüter, S.; Steinhart, H.; Schwarz, F.J.; Kirchgessner, M.,
Changes in the odorants of boiled carp fillet (Cyprinus carpio L.) as affected by increasing methionine levels in feed,
J. Agric. Food Chem., 1999, 47, 12, 5146-5150, https://doi.org/10.1021/jf9902604
. [all data]
Suriyaphan, Drake, et al., 1999
Suriyaphan, O.; Drake, M.A.; Cadwallader, K.R.,
Identification of volatile off-flavors in reduced-fat cheddar cheeses containing lecitin,
Lebensm.-Wiss. u. Technol., 1999, 32, 5, 250-254, https://doi.org/10.1006/fstl.1999.0543
. [all data]
Umano, Nakahara, et al., 1999
Umano, K.; Nakahara, K.; Shoji, A.; Shibamoto, T.,
Aroma chemicals isolated and identified from leaves of aloe arborescens Mill. Var. natalensis Berger,
J. Agric. Food Chem., 1999, 47, 9, 3702-3705, https://doi.org/10.1021/jf990116i
. [all data]
Buttery and Ling, 1998
Buttery, R.G.; Ling, L.C.,
Additional studies on flavor components of corn tortilla chips,
J. Agric. Food Chem., 1998, 46, 7, 2764-2769, https://doi.org/10.1021/jf980125b
. [all data]
Christensen and Reineccius, 1995
Christensen, K.R.; Reineccius, G.A.,
Aroma extract dilution analysis of aged cheddar cheese,
J. Food Sci., 1995, 60, 2, 218-220, https://doi.org/10.1111/j.1365-2621.1995.tb05641.x
. [all data]
Umano, Hagi, et al., 1995
Umano, K.; Hagi, Y.; Nakahara, K.; Shyoji, A.; Shibamoto, T.,
Volatile chemicals formed in the headspace of a heated D-glucose/L-cysteine Maillard model system,
J. Agric. Food Chem., 1995, 43, 8, 2212-2218, https://doi.org/10.1021/jf00056a046
. [all data]
Kawakami and Kobayashi, 1991
Kawakami, M.; Kobayashi, A.,
Volatitle constituents of greem mate and roasted mate,
J. Agric. Food Chem., 1991, 39, 7, 1275-1279, https://doi.org/10.1021/jf00007a016
. [all data]
Schieberle and Grosch, 1983
Schieberle, P.; Grosch, W.,
Identifizierung von Aromastoffen aus der Kruste von Roggenbrot,
Z. Lebensm. Unters. Forsch., 1983, 177, 3, 173-180, https://doi.org/10.1007/BF01146791
. [all data]
Yamaguchi and Shibamoto, 1980
Yamaguchi, K.; Shibamoto, T.,
Volatile constituents of the chestnut flower,
J. Agric. Food Chem., 1980, 28, 1, 82-84, https://doi.org/10.1021/jf60227a021
. [all data]
Welke, Manfroi, et al., 2012
Welke, J.E.; Manfroi, V.; Zanus, M.; Lazarotto, M.; Zini, C.A.,
Characterization of the volatile profile of Brazilian merlot wines through comprehensive two dimensional gas chromatography time-of-flight mass spectrometric detection,
J. Chromatogr. A, 2012, 1226, 124-139, https://doi.org/10.1016/j.chroma.2012.01.002
. [all data]
Johanningsmeier and McFeeters, 2011
Johanningsmeier, S.D.; McFeeters, R.F.,
Detection of volatile spoilage metabolites in fermented cucumbers using nontargeted, comprehensive 2-dimensional gas chromatography-time-of-flight mass spectrometry (GCxGCxTOFMS),
J. Food Sci., 2011, 76, 1, c168-c177, https://doi.org/10.1111/j.1750-3841.2010.01918.x
. [all data]
Povolo, Cabassi, et al., 2011
Povolo, M.; Cabassi, G.; Profaizer, M.; Lanteri, S.,
Study on the use of evolved gas analysis FT-IR (EGA FT-IR) for the evaluation of cheese volatile fraction,
The Open Food Sci. J., 2011, 5, 1, 10-16, https://doi.org/10.2174/1874256401105010010
. [all data]
Xiao, Dai, et al., 2011
Xiao, Z.; Dai, S.; Niu, Y.; Yu, H.; Zhu, J.; Tian, H.; Gu, Y.,
Discrimination of Chinese vinegars based on headspace solid-phase microextraction - gas chromatography mass spectrometry of volatile compounds and multivariate analysis,
J. Food Sci., 2011, 76, 8, c1125-c1135, https://doi.org/10.1111/j.1750-3841.2011.02356.x
. [all data]
Ferreira, Juan, et al., 2009
Ferreira, V.; Juan, F.S.; Escudero, A.; Cullere, L.; Fernandez-Zurbano, P.; Saenz-Navajas, M.P.; Cacho, J.,
Modeling quality of premium Spanish red wines from gas chromatography-olfactometry data,
J. Agr. Food. Chem., 2009, 57, 16, 7490-7498, https://doi.org/10.1021/jf9006483
. [all data]
Soria, Martinez-Castro, et al., 2009
Soria, A.C.; Martinez-Castro, I.; Sanz, J.,
Study of the precision in the purge-and-trap-gas-chromatography-mass-spectrometry analysis of volatile compounds in honey,
J. Chromatogr. A., 2009, 1216, 15, 3300-3304, https://doi.org/10.1016/j.chroma.2009.01.065
. [all data]
Soria, Martinez-Castro, et al., 2008
Soria, A.C.; Martinez-Castro, I.; Sanz, J.,
Some aspects of dynamic headspace analysis of volatile components in honey,
Foog Res. International, 2008, 41, 8, 838-848, https://doi.org/10.1016/j.foodres.2008.07.010
. [all data]
Berard, Bianchi, et al., 2007
Berard, J.; Bianchi, F.; Careri, M.; Chatel, A.; Mangia, A.; Musci, M.,
Characterization of the volatile fraction and of free fatty acids of Fontina Valle d'Aosta, a protected designation of origin Italian cheese,
Food Chem., 2007, 105, 1, 293-300, https://doi.org/10.1016/j.foodchem.2006.11.041
. [all data]
Gonzalez-Rios, Suarez-Quiroz, et al., 2007
Gonzalez-Rios, O.; Suarez-Quiroz, M.L.; Boulanger, R.; Barel, M.; Guyot, B.; Guiraud, J.-P.; Schorr-Galindo, S.,
Impact of ecological post-harvest processing of coffee aroma: II Roasted coffee.,
J. Food Composition Analysis, 2007, 20, 3-4, 297-307, https://doi.org/10.1016/j.jfca.2006.12.004
. [all data]
Loskos, Hernandez-Orte, et al., 2007
Loskos, N.; Hernandez-Orte, P.; Cacho, J.; Ferreira, V.,
Release and formation of varietal aroma compounds during alcoholic fermentation from nonfloral grape odorless flavor precursors fractions,
J. Agric. Food Chem., 2007, 55, 16, 6674-6684, https://doi.org/10.1021/jf0702343
. [all data]
Tian, Zhang, et al., 2007
Tian, Y.; Zhang, X.; Huang, T.; Zou, K.; Zhou, J.,
Research advances on the essential oils from leaves of Eucalyptus,
Food Fermentation Ind. (Chinese), 2007, 33, 10, 143-147. [all data]
Viegas and Bassoli, 2007
Viegas, M.C.; Bassoli, D.G.,
Utilizacao do indice de retencao linear para caracterizacao de compostos volateis em cafe soluvel utilizando GC-MS e coluna HP-Innowax,
Quim. Nova, 2007, 30, 8, 2031-2034, https://doi.org/10.1590/S0100-40422007000800040
. [all data]
Kourkoutas, Kandylis, et al., 2006
Kourkoutas, Y.; Kandylis, P.; Panas, P.; Dooley, J.S.G.; Nigam, P.; Koutinas, A.A.,
Evaluation of freeze-dried kefir coculture as starter in feta-type cheese production,
Appl. Environ. Microbiol., 2006, 72, 9, 6124-6135, https://doi.org/10.1128/AEM.03078-05
. [all data]
Tokitomo, Steihaus, et al., 2005
Tokitomo, Y.; Steihaus, M.; Buttner, A.; Schieberle, P.,
Odor-Active Constituents in Fresh Pineapple (ananas comosus [L.] Merr.) by Quamtitative and Sensory Evaluations,
Biosci. Biotechnol, Biochem,, 2005, 69, 7, 1323-1330, https://doi.org/10.1271/bbb.69.1323
. [all data]
Buettner and Welle, 2004
Buettner, A.; Welle, F.,
Intra-oral detection of potent odorants using a modified stir-bar sorptive extraction system in combination with HRGC-O, known as the buccal odour screening system (BOSS),
Flavour Fragr. J., 2004, 19, 6, 505-514, https://doi.org/10.1002/ffj.1473
. [all data]
Buettner, 2004
Buettner, A.,
Investigation of potent odorants and afterodor development in two chardonnay wines using the Buccal Odor Screening System (BOSS),
J. Agric. Food Chem., 2004, 52, 8, 2339-2346, https://doi.org/10.1021/jf035322b
. [all data]
Didzbalis, Ritter, et al., 2004
Didzbalis, J.; Ritter, K.A.; Trail, A.C.; Plog, F.J.,
Identification of fruity/fermented odorants in high-temperature-cured roasted peanuts,
J. Agric. Food Chem., 2004, 52, 15, 4828-4833, https://doi.org/10.1021/jf0355250
. [all data]
Baek and Cadwallader, 2003
Baek, H.H.; Cadwallader, K.R.,
Gas chromatographic/olfactometric evaluation of flavor extracts produced from crawfish processing by-products, 2003, retrieved from http://nsgl.gso.uri.edu/source/flsgpw95001/flsgpw95001part5.pdf. [all data]
Triqui and Bouchriti, 2003
Triqui, R.; Bouchriti, N.,
Freshness assessments of Moroccan sardine (Sardina pilchardus): comparison of overall sensory changes to instrumentally determined volatiles,
J. Agric. Food Chem., 2003, 51, 26, 7540-7546, https://doi.org/10.1021/jf0348166
. [all data]
Bel Rhild, Fleury, et al., 2002
Bel Rhild, R.; Fleury, Y.; Devaud, S.; Fay, L.B.; Blank, I.; Juillerat, M.A.,
Biogeneration of roasted noted based on 2-acetyl-2-thiazoline and the precursor 2-(1-hydroxyethyl)-4,5-dihydrothiazole, 2002, retrieved from http://www.imrablank.ch/ACS2002826179.pdf. [all data]
Bel Rhild, Fleury, et al., 2002, 2
Bel Rhild, R.; Fleury, Y.; Blank, I.; Fay, L.B.; Welti, D.H.; Vera F.A.; Juillerat, M.A.,
Generation of roasted notes based on 2-acetyl-2-thiazolidine and its precursor, 2-(1-hydroxyethyl)-4,5-dihydrothiazoline, by combined bio and thermal approaches,
J. Agr. Food Chem., 2002, 50, 8, 2350-2355, https://doi.org/10.1021/jf011170d
. [all data]
Lizárraga-Guerra, Guth, et al., 1997
Lizárraga-Guerra, R.; Guth, H.; López, M.G.,
Identification of the most potent odorants in huitlacoche (Ustilago maydis) and austern pilzen (Pleurotus sp.) by aroma extract dilution analysis and static head-space samples,
J. Agric. Food Chem., 1997, 45, 4, 1329-1332, https://doi.org/10.1021/jf960650f
. [all data]
Luning, de Rijk, et al., 1994
Luning, P.A.; de Rijk, T.; Wichers, H.J.; Roozen, J.P.,
Gas chromatography, mass spectrometry, and sniffing port analyses of volatile compounds of fresh bell peppers (Capsicum annuum) at different ripening stages,
J. Agric. Food Chem., 1994, 42, 4, 977-983, https://doi.org/10.1021/jf00040a027
. [all data]
Schieberle and Grosch, 1994
Schieberle, P.; Grosch, W.,
Potent odorants of rye bread crust - differences from the crumb and from wheat bread crust,
Z. Lebensm. Unters. Forsch., 1994, 198, 4, 292-296, https://doi.org/10.1007/BF01193177
. [all data]
Guth and Grosch, 1993
Guth, H.; Grosch, W.,
12-Methyltridecanal, a species-specific odorant of stewed beef,
Lebensm. Wiss. Technol., 1993, 26, 2, 171-177, https://doi.org/10.1006/fstl.1993.1035
. [all data]