Nickel, bis[(1,2,3-η)-2-pentenyl]-
- Formula: C10H18Ni
- Molecular weight: 196.9433
- IUPAC Standard InChIKey: SMMRHSXEQDQBDJ-UHFFFAOYSA-N
- CAS Registry Number: 43062-19-7
- Chemical structure:
View 3d structure (requires JavaScript / HTML 5) - Other names: Nickel, bis[(1,2,3-η3)-2-pentenyl]-

Gas phase ion energetics data

Data compiled by: Sharon G. Lias, Rhoda D. Levin, and Sherif A. Kafafi
Ionization energy determinations
IE (eV) | Method | Reference | Comment |
---|---|---|---|
7.22 | PE | Batich, 1976 | Vertical value |

References

Batich, 1976
Batich, C.,
Photoelectron spectroscopy of bis(π-allyl) nickel and its methyl substituted derivatives: support for the near validity of Koopmans' Theorem,
J. Am. Chem. Soc., 1976, 98, 7585. [all data]