Ethylidifluoroborane
- Formula: C2H5BF2
- Molecular weight: 77.869
- IUPAC Standard InChIKey: LYUQNYXHNCJGBN-UHFFFAOYSA-N
- CAS Registry Number: 430-41-1
- Chemical structure:
View 3d structure (requires JavaScript / HTML 5) - Permanent link for this species. Use this link for bookmarking this species for future reference.

Gas phase ion energetics data

Data compiled by: Henry M. Rosenstock, Keith Draxl, Bruce W. Steiner, and John T. Herron
Ionization energy determinations
IE (eV) | Method | Reference |
---|---|---|
11.8 ± 0.05 | EI | Steele, Nichols, et al., 1962 |
12.0 ± 0.2 | EI | Steele, Nichols, et al., 1962 |
Appearance energy determinations
Ion | AE (eV) | Other Products | Method | Reference | Comment |
---|---|---|---|---|---|
BF2+ | 14.3 ± 0.2 | C2H5 | EI | Steele, Nichols, et al., 1962 | |
C2H3BF+ | 12.0 ± 0.2 | ? | EI | Steele, Nichols, et al., 1962 | |
C2H4+ | 12.08 ± 0.01 | ? | EI | Steele, Nichols, et al., 1962 | |
C2H4BF+ | 12.6 ± 0.2 | ? | EI | Steele, Nichols, et al., 1962 | |
C2H5+ | 13.1 ± 0.2 | ? | EI | Steele, Nichols, et al., 1962 | |
C2H5BF+ | 12.1 ± 0.2 | F | EI | Steele, Nichols, et al., 1962 |

References

Steele, Nichols, et al., 1962
Steele, W.C.; Nichols, L.D.; Stone, F.G.A.,
An electron impact investigation of some organoboron difluorides,
J. Am. Chem. Soc., 1962, 84, 1154. [all data]