Cyclopentene,1-heptyl-
- Formula: C12H22
- Molecular weight: 166.3031
- IUPAC Standard InChIKey: FALRQTIXQCGLJF-UHFFFAOYSA-N
- CAS Registry Number: 4292-00-6
- Chemical structure:
View 3d structure (requires JavaScript / HTML 5) - Other names: 1-Heptyl-1-cyclopentene

Phase change data

Data compiled by: Thermodynamics Research Center, NIST Boulder Laboratories, Chris Muzny director
Quantity | Value | Units | Method | Reference | Comment |
---|---|---|---|---|---|
Tboil | 490. | K | N/A | Petrov, Sergienko, et al., 1956 | Uncertainty assigned by TRC = 15. K |

Gas phase ion energetics data

Data compiled by: Sharon G. Lias, Rhoda D. Levin, and Sherif A. Kafafi
Ionization energy determinations
IE (eV) | Method | Reference |
---|---|---|
8.41 ± 0.03 | PE | Rang, Paldoia, et al., 1974 |

Normal alkane RI, non-polar column, temperature ramp

Data compiled by: NIST Mass Spectrometry Data Center, William E. Wallace, director

Column type Capillary
Active phase SP-2100
Column length (m) 30.
Carrier gas He
Substrate
Column diameter (mm) 0.25
Phase thickness (μm)
Tstart (C) 40.
Tend (C) 250.
Heat rate (K/min) 4.
Initial hold (min)
Final hold (min)
I 1240.
ReferenceAlencar, Alves, et al., 1983
Comment MSDC-RI

References

Petrov, Sergienko, et al., 1956
Petrov, A.A.; Sergienko, S.R.; Tsedilina, A.L.; Egorov, Yu.P.,
Isomeric conversions of unsaturated hydrocarbons, c(12)-c(16),
Khim. Tekhnol. Topl. Masel, 1956, 1, 26-32. [all data]
Rang, Paldoia, et al., 1974
Rang, S.; Paldoia, P.; Talvari, A.,
Ionization potentials of unsaturated hydrocarbons. 2. Mono-substituted cyclopentenes and cyclohexenes,
Eesti. NSV Tead. Akad. Toim., 1974, 354. [all data]